{"text_format":"3","workbook":"xlsx","n_sheets":9,"sheets":["мониторинг","физкультура","соц-ком","познават","речевое","худ-эст","музыка","дети","Аннотация"],"not_rendered":{"charts":7,"defined_names":2},"read":"whole","date_system":"1900"}

{"sheet":"мониторинг","index":0,"n_rows":39,"n_cols":18,"rows_kept":39,"merged":[[0,0,0,17],[4,0,6,0],[4,2,4,15],[5,2,5,3],[5,4,5,5],[5,6,5,7],[5,8,5,9],[5,10,5,11],[5,12,5,13],[5,14,5,15],[5,16,5,17],[35,0,35,1]]}
[{"$f":"дети!A30","v":"Мониторинг образовательного процесса группы №___ (подготовительная)  на  20___-20___ уч год"}]
[null,{"$f":"дети!A31","v":"Воспитатель: ____________"}]
[null,{"$f":"дети!A32","v":"Воспитатель: ______________"}]
[{"$nulls":3},"Сводная образовательного процесса"]
["№ п/п","Имя,","Уровень развития по образовательным областям"]
[null,"фамилия ребенка","Физическая культура",null,"социально-коммуникативное",null,"Познавательное развитие",null,"Речевое развитие ",null,"художественно-эстетическое",null,"Музыкальная деятельность",null,"Итоговый результат",null,"Уровень"]
[null,null,"н.г.","к.г.","н.г.","к.г.","н.г.","к.г.","н.г.","к.г.","н.г.","к.г.","н.г.","к.г.","н.г.","к.г.","н.г.","к.г."]
[1,"Галиев Дамир",{"$f":"физкультура!O7","v":{"v":0,"d":"0.0"}},{"$f":"физкультура!P7","v":{"v":0,"d":"0.0"}},{"$f":"'соц-ком'!S8","v":{"v":0,"d":"0.0"}},{"$f":"'соц-ком'!T8","v":{"v":0,"d":"0.0"}},{"$f":"познават!Q7","v":{"v":0,"d":"0.0"}},{"$f":"познават!R7","v":{"v":0,"d":"0.0"}},{"$f":"речевое!O7","v":{"v":0,"d":"0.0"}},{"$f":"речевое!P7","v":{"v":0,"d":"0.0"}},{"$f":"'худ-эст'!S9","v":{"v":0,"d":"0.0"}},{"$f":"'худ-эст'!T9","v":{"v":0,"d":"0.0"}},{"$f":"музыка!K9","v":{"v":0,"d":"0.0"}},{"$f":"музыка!L9","v":{"v":0,"d":"0.0"}},{"$f":"(C8+E8+G8+I8+K8+M8)/6","v":{"v":0,"d":"0.0"}},{"$f":"(D8+F8+H8+J8+L8+N8)/6","v":{"v":0,"d":"0.0"}},{"$f":"IF(O8>2.9,\"B\",IF(O8>=2,\"C\",\"HC\"))","v":"HC"},{"$f":"IF(P8>2.9,\"B\",IF(P8>=2,\"C\",\"HC\"))","v":"HC"}]
[2,"Гарипова Софья",{"$f":"физкультура!O8","v":{"v":0,"d":"0.0"}},{"$f":"физкультура!P8","v":{"v":0,"d":"0.0"}},{"$f":"'соц-ком'!S9","v":{"v":0,"d":"0.0"}},{"$f":"'соц-ком'!T9","v":{"v":0,"d":"0.0"}},{"$f":"познават!Q8","v":{"v":0,"d":"0.0"}},{"$f":"познават!R8","v":{"v":0,"d":"0.0"}},{"$f":"речевое!O8","v":{"v":0,"d":"0.0"}},{"$f":"речевое!P8","v":{"v":0,"d":"0.0"}},{"$f":"'худ-эст'!S10","v":{"v":0,"d":"0.0"}},{"$f":"'худ-эст'!T10","v":{"v":0,"d":"0.0"}},{"$f":"музыка!K10","v":{"v":0,"d":"0.0"}},{"$f":"музыка!L10","v":{"v":0,"d":"0.0"}},{"$f":"(C9+E9+G9+I9+K9+M9)/6","v":{"v":0,"d":"0.0"}},{"$f":"(D9+F9+H9+J9+L9+N9)/6","v":{"v":0,"d":"0.0"}},{"$f":"IF(O9>2.9,\"B\",IF(O9>=2,\"C\",\"HC\"))","v":"HC"},"HC"]
[3,"Гимаев Ильгам",{"$f":"физкультура!O9","v":{"v":0,"d":"0.0"}},{"$f":"физкультура!P9","v":{"v":0,"d":"0.0"}},{"$f":"'соц-ком'!S10","v":{"v":0,"d":"0.0"}},{"$f":"'соц-ком'!T10","v":{"v":0,"d":"0.0"}},{"$f":"познават!Q9","v":{"v":0,"d":"0.0"}},{"$f":"познават!R9","v":{"v":0,"d":"0.0"}},{"$f":"речевое!O9","v":{"v":0,"d":"0.0"}},{"$f":"речевое!P9","v":{"v":0,"d":"0.0"}},{"$f":"'худ-эст'!S11","v":{"v":0,"d":"0.0"}},{"$f":"'худ-эст'!T11","v":{"v":0,"d":"0.0"}},{"$f":"музыка!K11","v":{"v":0,"d":"0.0"}},{"$f":"музыка!L11","v":{"v":0,"d":"0.0"}},{"v":0,"d":"0.0"},{"v":0,"d":"0.0"},{"$f":"IF(O10>2.9,\"B\",IF(O10>=2,\"C\",\"HC\"))","v":"HC"},"HC"]
[4,"Закиров Тимур",{"$f":"физкультура!O10","v":{"v":0,"d":"0.0"}},{"$f":"физкультура!P10","v":{"v":0,"d":"0.0"}},{"$f":"'соц-ком'!S11","v":{"v":0,"d":"0.0"}},{"$f":"'соц-ком'!T11","v":{"v":0,"d":"0.0"}},{"$f":"познават!Q10","v":{"v":0,"d":"0.0"}},{"$f":"познават!R10","v":{"v":0,"d":"0.0"}},{"$f":"речевое!O10","v":{"v":0,"d":"0.0"}},{"$f":"речевое!P10","v":{"v":0,"d":"0.0"}},{"$f":"'худ-эст'!S12","v":{"v":0,"d":"0.0"}},{"$f":"'худ-эст'!T12","v":{"v":0,"d":"0.0"}},{"$f":"музыка!K12","v":{"v":0,"d":"0.0"}},{"$f":"музыка!L12","v":{"v":0,"d":"0.0"}},{"v":0,"d":"0.0"},{"v":0,"d":"0.0"},{"$f":"IF(O11>2.9,\"B\",IF(O11>=2,\"C\",\"HC\"))","v":"HC"},"HC"]
[5,"Зарипова Ралина",{"$f":"физкультура!O11","v":{"v":0,"d":"0.0"}},{"$f":"физкультура!P11","v":{"v":0,"d":"0.0"}},{"$f":"'соц-ком'!S12","v":{"v":0,"d":"0.0"}},{"$f":"'соц-ком'!T12","v":{"v":0,"d":"0.0"}},{"$f":"познават!Q11","v":{"v":0,"d":"0.0"}},{"$f":"познават!R11","v":{"v":0,"d":"0.0"}},{"$f":"речевое!O11","v":{"v":0,"d":"0.0"}},{"$f":"речевое!P11","v":{"v":0,"d":"0.0"}},{"$f":"'худ-эст'!S13","v":{"v":0,"d":"0.0"}},{"$f":"'худ-эст'!T13","v":{"v":0,"d":"0.0"}},{"$f":"музыка!K13","v":{"v":0,"d":"0.0"}},{"$f":"музыка!L13","v":{"v":0,"d":"0.0"}},{"v":0,"d":"0.0"},{"v":0,"d":"0.0"},"HC","HC"]
[6,"Ибатуллина Диана",{"$f":"физкультура!O12","v":{"v":0,"d":"0.0"}},{"$f":"физкультура!P12","v":{"v":0,"d":"0.0"}},{"$f":"'соц-ком'!S13","v":{"v":0,"d":"0.0"}},{"$f":"'соц-ком'!T13","v":{"v":0,"d":"0.0"}},{"$f":"познават!Q12","v":{"v":0,"d":"0.0"}},{"$f":"познават!R12","v":{"v":0,"d":"0.0"}},{"$f":"речевое!O12","v":{"v":0,"d":"0.0"}},{"$f":"речевое!P12","v":{"v":0,"d":"0.0"}},{"$f":"'худ-эст'!S14","v":{"v":0,"d":"0.0"}},{"$f":"'худ-эст'!T14","v":{"v":0,"d":"0.0"}},{"$f":"музыка!K14","v":{"v":0,"d":"0.0"}},{"$f":"музыка!L14","v":{"v":0,"d":"0.0"}},{"v":0,"d":"0.0"},{"v":0,"d":"0.0"},"HC","HC"]
[7,"Ибатуллин Данис",{"$f":"физкультура!O13","v":{"v":0,"d":"0.0"}},{"$f":"физкультура!P13","v":{"v":0,"d":"0.0"}},{"$f":"'соц-ком'!S14","v":{"v":0,"d":"0.0"}},{"$f":"'соц-ком'!T14","v":{"v":0,"d":"0.0"}},{"$f":"познават!Q13","v":{"v":0,"d":"0.0"}},{"$f":"познават!R13","v":{"v":0,"d":"0.0"}},{"$f":"речевое!O13","v":{"v":0,"d":"0.0"}},{"$f":"речевое!P13","v":{"v":0,"d":"0.0"}},{"$f":"'худ-эст'!S15","v":{"v":0,"d":"0.0"}},{"$f":"'худ-эст'!T15","v":{"v":0,"d":"0.0"}},{"$f":"музыка!K15","v":{"v":0,"d":"0.0"}},{"$f":"музыка!L15","v":{"v":0,"d":"0.0"}},{"v":0,"d":"0.0"},{"v":0,"d":"0.0"},"HC","HC"]
[8,"Исламова Алия",{"$f":"физкультура!O14","v":{"v":0,"d":"0.0"}},{"$f":"физкультура!P14","v":{"v":0,"d":"0.0"}},{"$f":"'соц-ком'!S15","v":{"v":0,"d":"0.0"}},{"$f":"'соц-ком'!T15","v":{"v":0,"d":"0.0"}},{"$f":"познават!Q14","v":{"v":0,"d":"0.0"}},{"$f":"познават!R14","v":{"v":0,"d":"0.0"}},{"$f":"речевое!O14","v":{"v":0,"d":"0.0"}},{"$f":"речевое!P14","v":{"v":0,"d":"0.0"}},{"$f":"'худ-эст'!S16","v":{"v":0,"d":"0.0"}},{"$f":"'худ-эст'!T16","v":{"v":0,"d":"0.0"}},{"$f":"музыка!K16","v":{"v":0,"d":"0.0"}},{"$f":"музыка!L16","v":{"v":0,"d":"0.0"}},{"v":0,"d":"0.0"},{"v":0,"d":"0.0"},"HC","HC"]
[9,"Исмагилов Искандер",{"$f":"физкультура!O15","v":{"v":0,"d":"0.0"}},{"$f":"физкультура!P15","v":{"v":0,"d":"0.0"}},{"$f":"'соц-ком'!S16","v":{"v":0,"d":"0.0"}},{"$f":"'соц-ком'!T16","v":{"v":0,"d":"0.0"}},{"$f":"познават!Q15","v":{"v":0,"d":"0.0"}},{"$f":"познават!R15","v":{"v":0,"d":"0.0"}},{"$f":"речевое!O15","v":{"v":0,"d":"0.0"}},{"$f":"речевое!P15","v":{"v":0,"d":"0.0"}},{"$f":"'худ-эст'!S17","v":{"v":0,"d":"0.0"}},{"$f":"'худ-эст'!T17","v":{"v":0,"d":"0.0"}},{"$f":"музыка!K17","v":{"v":0,"d":"0.0"}},{"$f":"музыка!L17","v":{"v":0,"d":"0.0"}},{"v":0,"d":"0.0"},{"v":0,"d":"0.0"},"HC","HC"]
[10,"Калабина Юля",{"$f":"физкультура!O16","v":{"v":0,"d":"0.0"}},{"$f":"физкультура!P16","v":{"v":0,"d":"0.0"}},{"$f":"'соц-ком'!S17","v":{"v":0,"d":"0.0"}},{"$f":"'соц-ком'!T17","v":{"v":0,"d":"0.0"}},{"$f":"познават!Q16","v":{"v":0,"d":"0.0"}},{"$f":"познават!R16","v":{"v":0,"d":"0.0"}},{"$f":"речевое!O16","v":{"v":0,"d":"0.0"}},{"$f":"речевое!P16","v":{"v":0,"d":"0.0"}},{"$f":"'худ-эст'!S18","v":{"v":0,"d":"0.0"}},{"$f":"'худ-эст'!T18","v":{"v":0,"d":"0.0"}},{"$f":"музыка!K18","v":{"v":0,"d":"0.0"}},{"$f":"музыка!L18","v":{"v":0,"d":"0.0"}},{"v":0,"d":"0.0"},{"v":0,"d":"0.0"},"HC","HC"]
[11,"Касимов Эмир",{"$f":"физкультура!O17","v":{"v":0,"d":"0.0"}},{"$f":"физкультура!P17","v":{"v":0,"d":"0.0"}},{"$f":"'соц-ком'!S18","v":{"v":0,"d":"0.0"}},{"$f":"'соц-ком'!T18","v":{"v":0,"d":"0.0"}},{"$f":"познават!Q17","v":{"v":0,"d":"0.0"}},{"$f":"познават!R17","v":{"v":0,"d":"0.0"}},{"$f":"речевое!O17","v":{"v":0,"d":"0.0"}},{"$f":"речевое!P17","v":{"v":0,"d":"0.0"}},{"$f":"'худ-эст'!S19","v":{"v":0,"d":"0.0"}},{"$f":"'худ-эст'!T19","v":{"v":0,"d":"0.0"}},{"$f":"музыка!K19","v":{"v":0,"d":"0.0"}},{"$f":"музыка!L19","v":{"v":0,"d":"0.0"}},{"v":0,"d":"0.0"},{"v":0,"d":"0.0"},"HC","HC"]
[12,"Кузяшева Амина",{"$f":"физкультура!O18","v":{"v":0,"d":"0.0"}},{"$f":"физкультура!P18","v":{"v":0,"d":"0.0"}},{"$f":"'соц-ком'!S19","v":{"v":0,"d":"0.0"}},{"$f":"'соц-ком'!T19","v":{"v":0,"d":"0.0"}},{"$f":"познават!Q18","v":{"v":0,"d":"0.0"}},{"$f":"познават!R18","v":{"v":0,"d":"0.0"}},{"$f":"речевое!O18","v":{"v":0,"d":"0.0"}},{"$f":"речевое!P18","v":{"v":0,"d":"0.0"}},{"$f":"'худ-эст'!S20","v":{"v":0,"d":"0.0"}},{"$f":"'худ-эст'!T20","v":{"v":0,"d":"0.0"}},{"$f":"музыка!K20","v":{"v":0,"d":"0.0"}},{"$f":"музыка!L20","v":{"v":0,"d":"0.0"}},{"v":0,"d":"0.0"},{"v":0,"d":"0.0"},"HC","HC"]
[13,"Куроедова Анна",{"$f":"физкультура!O19","v":{"v":0,"d":"0.0"}},{"$f":"физкультура!P19","v":{"v":0,"d":"0.0"}},{"$f":"'соц-ком'!S20","v":{"v":0,"d":"0.0"}},{"$f":"'соц-ком'!T20","v":{"v":0,"d":"0.0"}},{"$f":"познават!Q19","v":{"v":0,"d":"0.0"}},{"$f":"познават!R19","v":{"v":0,"d":"0.0"}},{"$f":"речевое!O19","v":{"v":0,"d":"0.0"}},{"$f":"речевое!P19","v":{"v":0,"d":"0.0"}},{"$f":"'худ-эст'!S21","v":{"v":0,"d":"0.0"}},{"$f":"'худ-эст'!T21","v":{"v":0,"d":"0.0"}},{"$f":"музыка!K21","v":{"v":0,"d":"0.0"}},{"$f":"музыка!L21","v":{"v":0,"d":"0.0"}},{"v":0,"d":"0.0"},{"v":0,"d":"0.0"},"HC","HC"]
[14,"Лопатина Зарина",{"$f":"физкультура!O20","v":{"v":0,"d":"0.0"}},{"$f":"физкультура!P20","v":{"v":0,"d":"0.0"}},{"$f":"'соц-ком'!S21","v":{"v":0,"d":"0.0"}},{"$f":"'соц-ком'!T21","v":{"v":0,"d":"0.0"}},{"$f":"познават!Q20","v":{"v":0,"d":"0.0"}},{"$f":"познават!R20","v":{"v":0,"d":"0.0"}},{"$f":"речевое!O20","v":{"v":0,"d":"0.0"}},{"$f":"речевое!P20","v":{"v":0,"d":"0.0"}},{"$f":"'худ-эст'!S22","v":{"v":0,"d":"0.0"}},{"$f":"'худ-эст'!T22","v":{"v":0,"d":"0.0"}},{"$f":"музыка!K22","v":{"v":0,"d":"0.0"}},{"$f":"музыка!L22","v":{"v":0,"d":"0.0"}},{"v":0,"d":"0.0"},{"v":0,"d":"0.0"},"HC","HC"]
[15,"Мосеева Милана",{"$f":"физкультура!O21","v":{"v":0,"d":"0.0"}},{"$f":"физкультура!P21","v":{"v":0,"d":"0.0"}},{"$f":"'соц-ком'!S22","v":{"v":0,"d":"0.0"}},{"$f":"'соц-ком'!T22","v":{"v":0,"d":"0.0"}},{"$f":"познават!Q21","v":{"v":0,"d":"0.0"}},{"$f":"познават!R21","v":{"v":0,"d":"0.0"}},{"$f":"речевое!O21","v":{"v":0,"d":"0.0"}},{"$f":"речевое!P21","v":{"v":0,"d":"0.0"}},{"$f":"'худ-эст'!S23","v":{"v":0,"d":"0.0"}},{"$f":"'худ-эст'!T23","v":{"v":0,"d":"0.0"}},{"$f":"музыка!K14","v":{"v":0,"d":"0.0"}},{"$f":"музыка!L23","v":{"v":0,"d":"0.0"}},{"$f":"(C22+E22+G22+I22+K22+M22)/6","v":{"v":0,"d":"0.0"}},{"$f":"(D22+F22+H22+J22+L22+N22)/6","v":{"v":0,"d":"0.0"}},{"$f":"IF(O22>2.9,\"B\",IF(O22>=2,\"C\",\"HC\"))","v":"HC"},{"$f":"IF(P22>2.9,\"B\",IF(P22>=2,\"C\",\"HC\"))","v":"HC"}]
[16,"Невская Арина",{"$f":"физкультура!O22","v":{"v":0,"d":"0.0"}},{"$f":"физкультура!P22","v":{"v":0,"d":"0.0"}},{"$f":"'соц-ком'!S23","v":{"v":0,"d":"0.0"}},{"$f":"'соц-ком'!T23","v":{"v":0,"d":"0.0"}},{"$f":"познават!Q22","v":{"v":0,"d":"0.0"}},{"$f":"познават!R22","v":{"v":0,"d":"0.0"}},{"$f":"речевое!O22","v":{"v":0,"d":"0.0"}},{"$f":"речевое!P22","v":{"v":0,"d":"0.0"}},{"$f":"'худ-эст'!S24","v":{"v":0,"d":"0.0"}},{"$f":"'худ-эст'!T24","v":{"v":0,"d":"0.0"}},{"$f":"музыка!K15","v":{"v":0,"d":"0.0"}},{"$f":"музыка!L24","v":{"v":0,"d":"0.0"}},{"v":0,"d":"0.0"},{"v":0,"d":"0.0"},"HC","HC"]
[17,"Николаева София",{"$f":"физкультура!O23","v":{"v":0,"d":"0.0"}},{"$f":"физкультура!P23","v":{"v":0,"d":"0.0"}},{"$f":"'соц-ком'!S24","v":{"v":0,"d":"0.0"}},{"$f":"'соц-ком'!T24","v":{"v":0,"d":"0.0"}},{"$f":"познават!Q23","v":{"v":0,"d":"0.0"}},{"$f":"познават!R23","v":{"v":0,"d":"0.0"}},{"$f":"речевое!O23","v":{"v":0,"d":"0.0"}},{"$f":"речевое!P23","v":{"v":0,"d":"0.0"}},{"$f":"'худ-эст'!S25","v":{"v":0,"d":"0.0"}},{"$f":"'худ-эст'!T25","v":{"v":0,"d":"0.0"}},{"$f":"музыка!K16","v":{"v":0,"d":"0.0"}},{"$f":"музыка!L16","v":{"v":0,"d":"0.0"}},{"v":0,"d":"0.0"},{"v":0,"d":"0.0"},"HC","HC"]
[18,"Обухова Мария",{"$f":"физкультура!O24","v":{"v":0,"d":"0.0"}},{"$f":"физкультура!P24","v":{"v":0,"d":"0.0"}},{"$f":"'соц-ком'!S25","v":{"v":0,"d":"0.0"}},{"$f":"'соц-ком'!T25","v":{"v":0,"d":"0.0"}},{"$f":"познават!Q24","v":{"v":0,"d":"0.0"}},{"$f":"познават!R24","v":{"v":0,"d":"0.0"}},{"$f":"речевое!O24","v":{"v":0,"d":"0.0"}},{"$f":"речевое!P24","v":{"v":0,"d":"0.0"}},{"$f":"'худ-эст'!S26","v":{"v":0,"d":"0.0"}},{"$f":"'худ-эст'!T26","v":{"v":0,"d":"0.0"}},{"$f":"музыка!K17","v":{"v":0,"d":"0.0"}},{"$f":"музыка!L17","v":{"v":0,"d":"0.0"}},{"v":0,"d":"0.0"},{"v":0,"d":"0.0"},"HC","HC"]
[19,"Парфенова Анстасия",{"$f":"физкультура!O25","v":{"v":0,"d":"0.0"}},{"$f":"физкультура!P25","v":{"v":0,"d":"0.0"}},{"$f":"'соц-ком'!S26","v":{"v":0,"d":"0.0"}},{"$f":"'соц-ком'!T26","v":{"v":0,"d":"0.0"}},{"$f":"познават!Q25","v":{"v":0,"d":"0.0"}},{"$f":"познават!R25","v":{"v":0,"d":"0.0"}},{"$f":"речевое!O25","v":{"v":0,"d":"0.0"}},{"$f":"речевое!P25","v":{"v":0,"d":"0.0"}},{"$f":"'худ-эст'!S27","v":{"v":0,"d":"0.0"}},{"$f":"'худ-эст'!T27","v":{"v":0,"d":"0.0"}},{"$f":"музыка!K18","v":{"v":0,"d":"0.0"}},{"$f":"музыка!L18","v":{"v":0,"d":"0.0"}},{"v":0,"d":"0.0"},{"v":0,"d":"0.0"},"HC","HC"]
[20,"Сафина Лиана ",{"$f":"физкультура!O26","v":{"v":0,"d":"0.0"}},{"$f":"физкультура!P30","v":{"v":0,"d":"0.0"}},{"$f":"'соц-ком'!S27","v":{"v":0,"d":"0.0"}},{"$f":"'соц-ком'!T27","v":{"v":0,"d":"0.0"}},{"$f":"познават!Q26","v":{"v":0,"d":"0.0"}},{"$f":"познават!R26","v":{"v":0,"d":"0.0"}},{"$f":"речевое!O26","v":{"v":0,"d":"0.0"}},{"$f":"речевое!P26","v":{"v":0,"d":"0.0"}},{"$f":"'худ-эст'!S28","v":{"v":0,"d":"0.0"}},{"$f":"'худ-эст'!T28","v":{"v":0,"d":"0.0"}},{"$f":"музыка!K24","v":{"v":0,"d":"0.0"}},{"$f":"музыка!L24","v":{"v":0,"d":"0.0"}},{"v":0,"d":"0.0"},{"v":0,"d":"0.0"},"HC","HC"]
[21,"Степанова Аня",{"$f":"физкультура!O27","v":{"v":0,"d":"0.0"}},{"$f":"физкультура!P31","v":{"v":0,"d":"0.0"}},{"$f":"'соц-ком'!S28","v":{"v":0,"d":"0.0"}},{"$f":"'соц-ком'!T32","v":{"v":0,"d":"0.0"}},{"$f":"познават!Q31","v":{"v":0,"d":"0.0"}},{"$f":"познават!R31","v":{"v":0,"d":"0.0"}},{"$f":"речевое!O31","v":{"v":0,"d":"0.0"}},{"$f":"речевое!P31","v":{"v":0,"d":"0.0"}},{"$f":"'худ-эст'!S33","v":{"v":0,"d":"0.0"}},{"$f":"'худ-эст'!T33","v":{"v":0,"d":"0.0"}},{"$f":"музыка!K25","v":{"v":0,"d":"0.0"}},{"$f":"музыка!L25","v":{"v":0,"d":"0.0"}},{"v":0,"d":"0.0"},{"v":0,"d":"0.0"},"HC","HC"]
[22,"Тукаев Булат",{"$f":"физкультура!O28","v":{"v":0,"d":"0.0"}},{"$f":"физкультура!P32","v":{"v":0,"d":"0.0"}},{"$f":"'соц-ком'!S29","v":{"v":0,"d":"0.0"}},{"$f":"'соц-ком'!T33","v":{"v":0,"d":"0.0"}},{"$f":"познават!Q32","v":{"v":0,"d":"0.0"}},{"$f":"познават!R32","v":{"v":0,"d":"0.0"}},{"$f":"речевое!O32","v":{"v":0,"d":"0.0"}},{"$f":"речевое!P32","v":{"v":0,"d":"0.0"}},{"$f":"'худ-эст'!S34","v":{"v":0,"d":"0.0"}},{"$f":"'худ-эст'!T34","v":{"v":0,"d":"0.0"}},{"$f":"музыка!K26","v":{"v":0,"d":"0.0"}},{"$f":"музыка!L26","v":{"v":0,"d":"0.0"}},{"v":0,"d":"0.0"},{"v":0,"d":"0.0"},"HC","HC"]
[23,"Тюленев Максим",{"$f":"физкультура!O29","v":{"v":0,"d":"0.0"}},{"$f":"физкультура!P33","v":{"v":0,"d":"0.0"}},{"$f":"'соц-ком'!S30","v":{"v":0,"d":"0.0"}},{"$f":"'соц-ком'!T34","v":{"v":0,"d":"0.0"}},{"$f":"познават!Q33","v":{"v":0,"d":"0.0"}},{"$f":"познават!R33","v":{"v":0,"d":"0.0"}},{"$f":"речевое!O33","v":{"v":0,"d":"0.0"}},{"$f":"речевое!P33","v":{"v":0,"d":"0.0"}},{"$f":"'худ-эст'!S35","v":{"v":0,"d":"0.0"}},{"$f":"'худ-эст'!T35","v":{"v":0,"d":"0.0"}},{"$f":"музыка!K27","v":{"v":0,"d":"0.0"}},{"$f":"музыка!L27","v":{"v":0,"d":"0.0"}},{"v":0,"d":"0.0"},{"v":0,"d":"0.0"},"HC","HC"]
[24,"Файзрахманов Тимур",{"$f":"физкультура!O30","v":{"v":0,"d":"0.0"}},{"$f":"физкультура!P34","v":{"v":0,"d":"0.0"}},{"$f":"'соц-ком'!S31","v":{"v":0,"d":"0.0"}},{"$f":"'соц-ком'!T35","v":{"v":0,"d":"0.0"}},{"$f":"познават!Q34","v":{"v":0,"d":"0.0"}},{"$f":"познават!R34","v":{"v":0,"d":"0.0"}},{"$f":"речевое!O34","v":{"v":0,"d":"0.0"}},{"$f":"речевое!P34","v":{"v":0,"d":"0.0"}},{"$f":"'худ-эст'!S36","v":{"v":0,"d":"0.0"}},{"$f":"'худ-эст'!T36","v":{"v":0,"d":"0.0"}},{"$f":"музыка!K28","v":{"v":0,"d":"0.0"}},{"$f":"музыка!L28","v":{"v":0,"d":"0.0"}},{"v":0,"d":"0.0"},{"v":0,"d":"0.0"},"HC","HC"]
[25,"Фомичева Полина",{"$f":"физкультура!O31","v":{"v":0,"d":"0.0"}},{"$f":"физкультура!P35","v":{"$error":"#DIV/0!"}},{"$f":"'соц-ком'!S32","v":{"v":0,"d":"0.0"}},{"$f":"'соц-ком'!T36","v":{"$error":"#DIV/0!"}},{"$f":"познават!Q35","v":{"$error":"#DIV/0!"}},{"$f":"познават!R35","v":{"$error":"#DIV/0!"}},{"$f":"речевое!O35","v":{"$error":"#DIV/0!"}},{"$f":"речевое!P35","v":{"$error":"#DIV/0!"}},{"$f":"'худ-эст'!S37","v":{"$error":"#DIV/0!"}},{"$f":"'худ-эст'!T37","v":{"$error":"#DIV/0!"}},{"$f":"музыка!K29","v":{"v":0,"d":"0.0"}},{"$f":"музыка!L29","v":{"v":0,"d":"0.0"}},{"$error":"#DIV/0!"},{"$error":"#DIV/0!"},{"$error":"#DIV/0!"},{"$error":"#DIV/0!"}]
[26,"Хуснутдинов Саит",{"$f":"физкультура!O32","v":{"v":0,"d":"0.0"}},{"$f":"физкультура!P32","v":{"v":0,"d":"0.0"}},{"$f":"'соц-ком'!S33","v":{"v":0,"d":"0.0"}},{"$f":"'соц-ком'!T33","v":{"v":0,"d":"0.0"}},{"$f":"познават!Q32","v":{"v":0,"d":"0.0"}},{"$f":"познават!R32","v":{"v":0,"d":"0.0"}},{"$f":"речевое!O32","v":{"v":0,"d":"0.0"}},{"$f":"речевое!P32","v":{"v":0,"d":"0.0"}},{"$f":"'худ-эст'!S34","v":{"v":0,"d":"0.0"}},{"$f":"'худ-эст'!T34","v":{"v":0,"d":"0.0"}},{"$f":"музыка!K30","v":{"v":0,"d":"0.0"}},{"$f":"музыка!L26","v":{"v":0,"d":"0.0"}},{"$f":"(C33+E33+G33+I33+K33+M33)/6","v":{"v":0,"d":"0.0"}},{"v":0,"d":"0.0"},"HC","HC"]
[27,"Шагиахметова Адиля",{"$f":"физкультура!O33","v":{"v":0,"d":"0.0"}},{"$f":"физкультура!P33","v":{"v":0,"d":"0.0"}},{"$f":"'соц-ком'!S34","v":{"v":0,"d":"0.0"}},{"$f":"'соц-ком'!T34","v":{"v":0,"d":"0.0"}},{"$f":"познават!Q33","v":{"v":0,"d":"0.0"}},{"$f":"познават!R33","v":{"v":0,"d":"0.0"}},{"$f":"речевое!O33","v":{"v":0,"d":"0.0"}},{"$f":"речевое!P33","v":{"v":0,"d":"0.0"}},{"$f":"'худ-эст'!S35","v":{"v":0,"d":"0.0"}},{"$f":"'худ-эст'!T35","v":{"v":0,"d":"0.0"}},{"$f":"музыка!K35","v":{"v":0,"d":"0.0"}},{"$f":"музыка!L35","v":{"v":0,"d":"0.0"}},{"v":0,"d":"0.0"},{"v":0,"d":"0.0"},"HC","HC"]
[28,"Юнусов Ислам",{"$f":"физкультура!O34","v":{"v":0,"d":"0.0"}},{"v":3,"d":"3.0"},{"$f":"'соц-ком'!S35","v":{"v":0,"d":"0.0"}},{"v":3,"d":"3.0"},{"$f":"познават!Q34","v":{"v":0,"d":"0.0"}},{"v":3,"d":"3.0"},{"$f":"речевое!O34","v":{"v":0,"d":"0.0"}},{"v":3,"d":"3.0"},{"$f":"'худ-эст'!S36","v":{"v":0,"d":"0.0"}},{"v":3,"d":"3.0"},{"$f":"музыка!K36","v":{"v":2,"d":"2.0"}},{"v":3,"d":"3.0"},{"v":0.3333333333333333,"d":"0.3"},{"v":3,"d":"3.0"},"В","В"]
["Итоговый пок. по гр. (ср. значение)",null,{"$f":"SUM(C8:C35)/дети!G2","v":{"$error":"#DIV/0!"}},{"$f":"SUM(D8:D35)/дети!G2","v":{"$error":"#DIV/0!"}},{"$f":"SUM(E8:E35)/дети!G2","v":{"$error":"#DIV/0!"}},{"$f":"SUM(F8:F35)/дети!G2","v":{"$error":"#DIV/0!"}},{"$f":"SUM(G8:G35)/дети!G2","v":{"$error":"#DIV/0!"}},{"$f":"SUM(H8:H35)/дети!G2","v":{"$error":"#DIV/0!"}},{"$f":"SUM(I8:I35)/дети!G2","v":{"$error":"#DIV/0!"}},{"$f":"SUM(J8:J35)/дети!G2","v":{"$error":"#DIV/0!"}},{"$f":"SUM(K8:K35)/дети!G2","v":{"$error":"#DIV/0!"}},{"$f":"SUM(L8:L35)/дети!G2","v":{"$error":"#DIV/0!"}},{"$f":"музыка!K37","v":{"$error":"#DIV/0!"}},{"$f":"музыка!L37","v":{"$error":"#DIV/0!"}},{"$f":"SUM(O8:O35)/дети!G2","v":{"$error":"#DIV/0!"}},{"$f":"SUM(P8:P35)/дети!G2","v":{"$error":"#DIV/0!"}}]
[null,"\"3\" Сформирован (В)",{"$f":"COUNTIF(C8:C35,\"=3\")/дети!G2","v":{"$error":"#DIV/0!"}},{"$f":"COUNTIF(D8:D35,\"=3\")/дети!G2","v":{"$error":"#DIV/0!"}},{"$f":"COUNTIF(E8:E35,\"=3\")/дети!G2","v":{"$error":"#DIV/0!"}},{"$f":"COUNTIF(F8:F35,\"=3\")/дети!G2","v":{"$error":"#DIV/0!"}},{"$f":"COUNTIF(G8:G35,\"=3\")/дети!G2","v":{"$error":"#DIV/0!"}},{"$f":"COUNTIF(H8:H35,\"=3\")/дети!G2","v":{"$error":"#DIV/0!"}},{"$f":"COUNTIF(I8:I35,\"=3\")/дети!G2","v":{"$error":"#DIV/0!"}},{"$f":"COUNTIF(J8:J35,\"=3\")/дети!G2","v":{"$error":"#DIV/0!"}},{"$f":"COUNTIF(K8:K35,\"=3\")/дети!G2","v":{"$error":"#DIV/0!"}},{"$f":"COUNTIF(L8:L35,\"=3\")/дети!G2","v":{"$error":"#DIV/0!"}},{"$f":"COUNTIF(M8:M35,\"=3\")/дети!G2","v":{"$error":"#DIV/0!"}},{"$f":"COUNTIF(N8:N35,\"=3\")/дети!G2","v":{"$error":"#DIV/0!"}},{"$f":"COUNTIF(O8:O35,\"=3\")/дети!G2","v":{"$error":"#DIV/0!"}},{"$f":"COUNTIF(P8:P35,\"=3\")/дети!G2","v":{"$error":"#DIV/0!"}}]
[null,"\"2\" Находится в стадии формирования (С)",{"$f":"100%-(C39+C37)","v":{"$error":"#DIV/0!"}},{"$error":"#DIV/0!"},{"$error":"#DIV/0!"},{"$error":"#DIV/0!"},{"$error":"#DIV/0!"},{"$error":"#DIV/0!"},{"$error":"#DIV/0!"},{"$error":"#DIV/0!"},{"$error":"#DIV/0!"},{"$error":"#DIV/0!"},{"$error":"#DIV/0!"},{"v":0,"d":"0%"},{"$f":"100%-(O39+O37)","v":{"$error":"#DIV/0!"}},{"$f":"100%-(P39+P37)","v":{"$error":"#DIV/0!"}}]
[null,"\"1\" Не сформирован (НС)",{"$f":"COUNTIF(C8:C35,\"<2\")/дети!G2","v":{"$error":"#DIV/0!"}},{"$f":"COUNTIF(D8:D35,\"<2\")/дети!G2","v":{"$error":"#DIV/0!"}},{"$f":"COUNTIF(E8:E35,\"<2\")/дети!G2","v":{"$error":"#DIV/0!"}},{"$f":"COUNTIF(F8:F35,\"<2\")/дети!G2","v":{"$error":"#DIV/0!"}},{"$f":"COUNTIF(G8:G35,\"<2\")/дети!G2","v":{"$error":"#DIV/0!"}},{"$f":"COUNTIF(H8:H35,\"<2\")/дети!G2","v":{"$error":"#DIV/0!"}},{"$f":"COUNTIF(I8:I35,\"<2\")/дети!G2","v":{"$error":"#DIV/0!"}},{"$f":"COUNTIF(J8:J35,\"<2\")/дети!G2","v":{"$error":"#DIV/0!"}},{"$f":"COUNTIF(K8:K35,\"<2\")/дети!G2","v":{"$error":"#DIV/0!"}},{"$f":"COUNTIF(L8:L35,\"<2\")/дети!G2","v":{"$error":"#DIV/0!"}},{"$f":"COUNTIF(M8:M35,\"<2\")/дети!G2","v":{"$error":"#DIV/0!"}},{"v":0,"d":"0%"},{"$f":"COUNTIF(O8:O35,\"<2\")/дети!G2","v":{"$error":"#DIV/0!"}},{"$f":"COUNTIF(P8:P35,\"<2\")/дети!G2","v":{"$error":"#DIV/0!"}}]

{"sheet":"физкультура","index":1,"n_rows":38,"n_cols":18,"rows_kept":38,"merged":[[0,0,0,17],[4,0,5,0],[4,1,5,1],[4,2,4,3],[4,4,4,5],[4,6,4,7],[4,8,4,9],[4,10,4,11],[4,12,4,13],[4,14,4,15],[4,16,4,17],[34,0,34,1]]}
[{"$f":"дети!A30","v":"Мониторинг образовательного процесса группы №___ (подготовительная)  на  20___-20___ уч год"}]
[null,{"$f":"дети!A31","v":"Воспитатель: ____________"}]
[null,{"$f":"дети!A32","v":"Воспитатель: ______________"}]
[null,null,"Образовательная область «Физкультура» "]
["№ п/п","Фамилия, имя ребенка","Имеет сформированные представления о здоровом образе жизни",null,"Умеет прыгать в длину с места, с разбега, в высоту с разбега, через скакалку",null,"Умеет перестраиваться в 3-4 колонны, в 2-3 круга на ходу, в 2 шеренги после пересчета, соблюдает интервалы в передвижении",null,"Умеет метать предметы правой и левой руками в вертикальную и горизонтальную цели, в движущуюся цель, отбивает и ловит мяч",null,"Выполняет ОРУ четко и ритмично, ходит на лыжах, катается на самокате, участвует в спортивных играх, умеет плавать",null,"Следит за пра-вильной осанкой",null,"Итоговый показатель по каждому ребенку (ср. значение)",null,"Уровень"]
[null,null,"н.г.","к.г.","н.г.","к.г.","н.г.","к.г.","н.г.","к.г.","н.г.","к.г.","н.г.","к.г.","н.г.","к.г.","н.г.","к.г."]
[1,{"$f":"дети!A1","v":0},{"v":0,"d":"0.0"},{"v":0,"d":"0.0"},{"v":0,"d":"0.0"},{"v":0,"d":"0.0"},{"v":0,"d":"0.0"},{"v":0,"d":"0.0"},{"v":0,"d":"0.0"},{"v":0,"d":"0.0"},{"v":0,"d":"0.0"},{"v":0,"d":"0.0"},{"v":0,"d":"0.0"},{"v":0,"d":"0.0"},{"$f":"(C7+E7+G7+I7+K7+M7)/6","v":{"v":0,"d":"0.0"}},{"$f":"(D7+F7+H7+J7+L7+N7)/6","v":{"v":0,"d":"0.0"}},{"$f":"IF(O7=3,\"B\",IF(O7>=2,\"C\",\"HC\"))","v":"HC"},{"$f":"IF(P7=3,\"B\",IF(P7>=2,\"C\",\"HC\"))","v":"HC"}]
[2,{"$f":"дети!A2","v":0},{"v":0,"d":"0.0"},{"v":0,"d":"0.0"},{"v":0,"d":"0.0"},{"v":0,"d":"0.0"},{"v":0,"d":"0.0"},{"v":0,"d":"0.0"},{"v":0,"d":"0.0"},{"v":0,"d":"0.0"},{"v":0,"d":"0.0"},{"v":0,"d":"0.0"},{"v":0,"d":"0.0"},{"v":0,"d":"0.0"},{"$f":"(C8+E8+G8+I8+K8+M8)/6","v":{"v":0,"d":"0.0"}},{"$f":"(D8+F8+H8+J8+L8+N8)/6","v":{"v":0,"d":"0.0"}},{"$f":"IF(O8=3,\"B\",IF(O8>=2,\"C\",\"HC\"))","v":"HC"},{"$f":"IF(P8=3,\"B\",IF(P8>=2,\"C\",\"HC\"))","v":"HC"}]
[3,{"$f":"дети!A3","v":0},{"v":0,"d":"0.0"},{"v":0,"d":"0.0"},{"v":0,"d":"0.0"},{"v":0,"d":"0.0"},{"v":0,"d":"0.0"},{"v":0,"d":"0.0"},{"v":0,"d":"0.0"},{"v":0,"d":"0.0"},{"v":0,"d":"0.0"},{"v":0,"d":"0.0"},{"v":0,"d":"0.0"},{"v":0,"d":"0.0"},{"v":0,"d":"0.0"},{"v":0,"d":"0.0"},"HC","HC"]
[4,{"$f":"дети!A4","v":0},{"v":0,"d":"0.0"},{"v":0,"d":"0.0"},{"v":0,"d":"0.0"},{"v":0,"d":"0.0"},{"v":0,"d":"0.0"},{"v":0,"d":"0.0"},{"v":0,"d":"0.0"},{"v":0,"d":"0.0"},{"v":0,"d":"0.0"},{"v":0,"d":"0.0"},{"v":0,"d":"0.0"},{"v":0,"d":"0.0"},{"v":0,"d":"0.0"},{"v":0,"d":"0.0"},"HC","HC"]
[5,{"$f":"дети!A5","v":0},{"v":0,"d":"0.0"},{"v":0,"d":"0.0"},{"v":0,"d":"0.0"},{"v":0,"d":"0.0"},{"v":0,"d":"0.0"},{"v":0,"d":"0.0"},{"v":0,"d":"0.0"},{"v":0,"d":"0.0"},{"v":0,"d":"0.0"},{"v":0,"d":"0.0"},{"v":0,"d":"0.0"},{"v":0,"d":"0.0"},{"v":0,"d":"0.0"},{"v":0,"d":"0.0"},"HC","HC"]
[6,{"$f":"дети!A6","v":0},{"v":0,"d":"0.0"},{"v":0,"d":"0.0"},{"v":0,"d":"0.0"},{"v":0,"d":"0.0"},{"v":0,"d":"0.0"},{"v":0,"d":"0.0"},{"v":0,"d":"0.0"},{"v":0,"d":"0.0"},{"v":0,"d":"0.0"},{"v":0,"d":"0.0"},{"v":0,"d":"0.0"},{"v":0,"d":"0.0"},{"v":0,"d":"0.0"},{"v":0,"d":"0.0"},"HC","HC"]
[7,{"$f":"дети!A7","v":0},{"v":0,"d":"0.0"},{"v":0,"d":"0.0"},{"v":0,"d":"0.0"},{"v":0,"d":"0.0"},{"v":0,"d":"0.0"},{"v":0,"d":"0.0"},{"v":0,"d":"0.0"},{"v":0,"d":"0.0"},{"v":0,"d":"0.0"},{"v":0,"d":"0.0"},{"v":0,"d":"0.0"},{"v":0,"d":"0.0"},{"v":0,"d":"0.0"},{"v":0,"d":"0.0"},"HC","HC"]
[8,{"$f":"дети!A8","v":0},{"v":0,"d":"0.0"},{"v":0,"d":"0.0"},{"v":0,"d":"0.0"},{"v":0,"d":"0.0"},{"v":0,"d":"0.0"},{"v":0,"d":"0.0"},{"v":0,"d":"0.0"},{"v":0,"d":"0.0"},{"v":0,"d":"0.0"},{"v":0,"d":"0.0"},{"v":0,"d":"0.0"},{"v":0,"d":"0.0"},{"v":0,"d":"0.0"},{"v":0,"d":"0.0"},"HC","HC"]
[9,{"$f":"дети!A9","v":0},{"v":0,"d":"0.0"},{"v":0,"d":"0.0"},{"v":0,"d":"0.0"},{"v":0,"d":"0.0"},{"v":0,"d":"0.0"},{"v":0,"d":"0.0"},{"v":0,"d":"0.0"},{"v":0,"d":"0.0"},{"v":0,"d":"0.0"},{"v":0,"d":"0.0"},{"v":0,"d":"0.0"},{"v":0,"d":"0.0"},{"v":0,"d":"0.0"},{"v":0,"d":"0.0"},"HC","HC"]
[10,{"$f":"дети!A10","v":0},{"v":0,"d":"0.0"},{"v":0,"d":"0.0"},{"v":0,"d":"0.0"},{"v":0,"d":"0.0"},{"v":0,"d":"0.0"},{"v":0,"d":"0.0"},{"v":0,"d":"0.0"},{"v":0,"d":"0.0"},{"v":0,"d":"0.0"},{"v":0,"d":"0.0"},{"v":0,"d":"0.0"},{"v":0,"d":"0.0"},{"v":0,"d":"0.0"},{"v":0,"d":"0.0"},"HC","HC"]
[11,{"$f":"дети!A11","v":0},{"v":0,"d":"0.0"},{"v":0,"d":"0.0"},{"v":0,"d":"0.0"},{"v":0,"d":"0.0"},{"v":0,"d":"0.0"},{"v":0,"d":"0.0"},{"v":0,"d":"0.0"},{"v":0,"d":"0.0"},{"v":0,"d":"0.0"},{"v":0,"d":"0.0"},{"v":0,"d":"0.0"},{"v":0,"d":"0.0"},{"v":0,"d":"0.0"},{"v":0,"d":"0.0"},"HC","HC"]
[12,{"$f":"дети!A12","v":0},{"v":0,"d":"0.0"},{"v":0,"d":"0.0"},{"v":0,"d":"0.0"},{"v":0,"d":"0.0"},{"v":0,"d":"0.0"},{"v":0,"d":"0.0"},{"v":0,"d":"0.0"},{"v":0,"d":"0.0"},{"v":0,"d":"0.0"},{"v":0,"d":"0.0"},{"v":0,"d":"0.0"},{"v":0,"d":"0.0"},{"v":0,"d":"0.0"},{"v":0,"d":"0.0"},"HC","HC"]
[13,{"$f":"дети!A13","v":0},{"v":0,"d":"0.0"},{"v":0,"d":"0.0"},{"v":0,"d":"0.0"},{"v":0,"d":"0.0"},{"v":0,"d":"0.0"},{"v":0,"d":"0.0"},{"v":0,"d":"0.0"},{"v":0,"d":"0.0"},{"v":0,"d":"0.0"},{"v":0,"d":"0.0"},{"v":0,"d":"0.0"},{"v":0,"d":"0.0"},{"v":0,"d":"0.0"},{"v":0,"d":"0.0"},"HC","HC"]
[14,{"$f":"дети!A14","v":0},{"v":0,"d":"0.0"},{"v":0,"d":"0.0"},{"v":0,"d":"0.0"},{"v":0,"d":"0.0"},{"v":0,"d":"0.0"},{"v":0,"d":"0.0"},{"v":0,"d":"0.0"},{"v":0,"d":"0.0"},{"v":0,"d":"0.0"},{"v":0,"d":"0.0"},{"v":0,"d":"0.0"},{"v":0,"d":"0.0"},{"v":0,"d":"0.0"},{"v":0,"d":"0.0"},"HC","HC"]
[15,{"$f":"дети!A15","v":0},{"v":0,"d":"0.0"},{"v":0,"d":"0.0"},{"v":0,"d":"0.0"},{"v":0,"d":"0.0"},{"v":0,"d":"0.0"},{"v":0,"d":"0.0"},{"v":0,"d":"0.0"},{"v":0,"d":"0.0"},{"v":0,"d":"0.0"},{"v":0,"d":"0.0"},{"v":0,"d":"0.0"},{"v":0,"d":"0.0"},{"v":0,"d":"0.0"},{"v":0,"d":"0.0"},{"$f":"IF(O21=3,\"B\",IF(O21>=2,\"C\",\"HC\"))","v":"HC"},{"$f":"IF(P21=3,\"B\",IF(P21>=2,\"C\",\"HC\"))","v":"HC"}]
[16,{"$f":"дети!A16","v":0},{"v":0,"d":"0.0"},{"v":0,"d":"0.0"},{"v":0,"d":"0.0"},{"v":0,"d":"0.0"},{"v":0,"d":"0.0"},{"v":0,"d":"0.0"},{"v":0,"d":"0.0"},{"v":0,"d":"0.0"},{"v":0,"d":"0.0"},{"v":0,"d":"0.0"},{"v":0,"d":"0.0"},{"v":0,"d":"0.0"},{"v":0,"d":"0.0"},{"v":0,"d":"0.0"},"HC","HC"]
[17,{"$f":"дети!A17","v":0},{"v":0,"d":"0.0"},{"v":0,"d":"0.0"},{"v":0,"d":"0.0"},{"v":0,"d":"0.0"},{"v":0,"d":"0.0"},{"v":0,"d":"0.0"},{"v":0,"d":"0.0"},{"v":0,"d":"0.0"},{"v":0,"d":"0.0"},{"v":0,"d":"0.0"},{"v":0,"d":"0.0"},{"v":0,"d":"0.0"},{"v":0,"d":"0.0"},{"v":0,"d":"0.0"},"HC","HC"]
[18,{"$f":"дети!A18","v":0},{"v":0,"d":"0.0"},{"v":0,"d":"0.0"},{"v":0,"d":"0.0"},{"v":0,"d":"0.0"},{"v":0,"d":"0.0"},{"v":0,"d":"0.0"},{"v":0,"d":"0.0"},{"v":0,"d":"0.0"},{"v":0,"d":"0.0"},{"v":0,"d":"0.0"},{"v":0,"d":"0.0"},{"v":0,"d":"0.0"},{"v":0,"d":"0.0"},{"v":0,"d":"0.0"},"HC","HC"]
[19,{"$f":"дети!A19","v":0},{"v":0,"d":"0.0"},{"v":0,"d":"0.0"},{"v":0,"d":"0.0"},{"v":0,"d":"0.0"},{"v":0,"d":"0.0"},{"v":0,"d":"0.0"},{"v":0,"d":"0.0"},{"v":0,"d":"0.0"},{"v":0,"d":"0.0"},{"v":0,"d":"0.0"},{"v":0,"d":"0.0"},{"v":0,"d":"0.0"},{"v":0,"d":"0.0"},{"v":0,"d":"0.0"},"HC","HC"]
[20,{"$f":"дети!A20","v":0},{"v":0,"d":"0.0"},{"v":0,"d":"0.0"},{"v":0,"d":"0.0"},{"v":0,"d":"0.0"},{"v":0,"d":"0.0"},{"v":0,"d":"0.0"},{"v":0,"d":"0.0"},{"v":0,"d":"0.0"},{"v":0,"d":"0.0"},{"v":0,"d":"0.0"},{"v":0,"d":"0.0"},{"v":0,"d":"0.0"},{"v":0,"d":"0.0"},{"v":0,"d":"0.0"},"HC","HC"]
[21,{"$f":"дети!A21","v":0},{"v":0,"d":"0.0"},{"v":0,"d":"0.0"},{"v":0,"d":"0.0"},{"v":0,"d":"0.0"},{"v":0,"d":"0.0"},{"v":0,"d":"0.0"},{"v":0,"d":"0.0"},{"v":0,"d":"0.0"},{"v":0,"d":"0.0"},{"v":0,"d":"0.0"},{"v":0,"d":"0.0"},{"v":0,"d":"0.0"},{"v":0,"d":"0.0"},{"v":0,"d":"0.0"},"HC","HC"]
[22,{"$f":"дети!A22","v":0},{"v":0,"d":"0.0"},{"v":0,"d":"0.0"},{"v":0,"d":"0.0"},{"v":0,"d":"0.0"},{"v":0,"d":"0.0"},{"v":0,"d":"0.0"},{"v":0,"d":"0.0"},{"v":0,"d":"0.0"},{"v":0,"d":"0.0"},{"v":0,"d":"0.0"},{"v":0,"d":"0.0"},{"v":0,"d":"0.0"},{"v":0,"d":"0.0"},{"v":0,"d":"0.0"},"HC","HC"]
[23,{"$f":"дети!A23","v":0},{"v":0,"d":"0.0"},{"v":0,"d":"0.0"},{"v":0,"d":"0.0"},{"v":0,"d":"0.0"},{"v":0,"d":"0.0"},{"v":0,"d":"0.0"},{"v":0,"d":"0.0"},{"v":0,"d":"0.0"},{"v":0,"d":"0.0"},{"v":0,"d":"0.0"},{"v":0,"d":"0.0"},{"v":0,"d":"0.0"},{"v":0,"d":"0.0"},{"v":0,"d":"0.0"},"HC","HC"]
[24,{"$f":"дети!A24","v":0},{"v":0,"d":"0.0"},{"v":0,"d":"0.0"},{"v":0,"d":"0.0"},{"v":0,"d":"0.0"},{"v":0,"d":"0.0"},{"v":0,"d":"0.0"},{"v":0,"d":"0.0"},{"v":0,"d":"0.0"},{"v":0,"d":"0.0"},{"v":0,"d":"0.0"},{"v":0,"d":"0.0"},{"v":0,"d":"0.0"},{"v":0,"d":"0.0"},{"v":0,"d":"0.0"},"HC","HC"]
[25,{"$f":"дети!A25","v":0},{"v":0,"d":"0.0"},{"v":0,"d":"0.0"},{"v":0,"d":"0.0"},{"v":0,"d":"0.0"},{"v":0,"d":"0.0"},{"v":0,"d":"0.0"},{"v":0,"d":"0.0"},{"v":0,"d":"0.0"},{"v":0,"d":"0.0"},{"v":0,"d":"0.0"},{"v":0,"d":"0.0"},{"v":0,"d":"0.0"},{"v":0,"d":"0.0"},{"v":0,"d":"0.0"},{"$f":"IF(O31=3,\"B\",IF(O31>=2,\"C\",\"HC\"))","v":"HC"},"HC"]
[26,{"$f":"дети!A26","v":0},{"v":0,"d":"0.0"},{"v":0,"d":"0.0"},{"v":0,"d":"0.0"},{"v":0,"d":"0.0"},{"v":0,"d":"0.0"},{"v":0,"d":"0.0"},{"v":0,"d":"0.0"},{"v":0,"d":"0.0"},{"v":0,"d":"0.0"},{"v":0,"d":"0.0"},{"v":0,"d":"0.0"},{"v":0,"d":"0.0"},{"v":0,"d":"0.0"},{"v":0,"d":"0.0"},{"$f":"IF(O32=3,\"B\",IF(O32>=2,\"C\",\"HC\"))","v":"HC"},"HC"]
[27,{"$f":"дети!A27","v":0},{"v":0,"d":"0.0"},{"v":0,"d":"0.0"},{"v":0,"d":"0.0"},{"v":0,"d":"0.0"},{"v":0,"d":"0.0"},{"v":0,"d":"0.0"},{"v":0,"d":"0.0"},{"v":0,"d":"0.0"},{"v":0,"d":"0.0"},{"v":0,"d":"0.0"},{"v":0,"d":"0.0"},{"v":0,"d":"0.0"},{"v":0,"d":"0.0"},{"v":0,"d":"0.0"},{"$f":"IF(O33=3,\"B\",IF(O33>=2,\"C\",\"HC\"))","v":"HC"},"HC"]
[28,{"$f":"дети!A28","v":0},{"v":0,"d":"0.0"},{"v":0,"d":"0.0"},{"v":0,"d":"0.0"},{"v":0,"d":"0.0"},{"v":0,"d":"0.0"},{"v":0,"d":"0.0"},{"v":0,"d":"0.0"},{"v":0,"d":"0.0"},{"v":0,"d":"0.0"},{"v":0,"d":"0.0"},{"v":0,"d":"0.0"},{"v":0,"d":"0.0"},{"v":0,"d":"0.0"},{"v":0,"d":"0.0"},{"$f":"IF(O34=3,\"B\",IF(O34>=2,\"C\",\"HC\"))","v":"HC"},"HC"]
["Итоговый показатель по группе (среднее значение)",null,{"$f":"SUM(C7:C34)/дети!G2","v":{"$error":"#DIV/0!"}},{"$f":"SUM(D7:D34)/дети!G2","v":{"$error":"#DIV/0!"}},{"$f":"SUM(E7:E34)/дети!G2","v":{"$error":"#DIV/0!"}},{"$f":"SUM(F7:F34)/дети!G2","v":{"$error":"#DIV/0!"}},{"$f":"SUM(G7:G34)/дети!G2","v":{"$error":"#DIV/0!"}},{"$f":"SUM(H7:H34)/дети!G2","v":{"$error":"#DIV/0!"}},{"$f":"SUM(I7:I34)/дети!G2","v":{"$error":"#DIV/0!"}},{"$f":"SUM(J7:J34)/дети!G2","v":{"$error":"#DIV/0!"}},{"$f":"SUM(K7:K34)/дети!G2","v":{"$error":"#DIV/0!"}},{"$f":"SUM(L7:L34)/дети!G2","v":{"$error":"#DIV/0!"}},{"$f":"SUM(M7:M34)/дети!G2","v":{"$error":"#DIV/0!"}},{"$f":"SUM(N7:N34)/дети!G2","v":{"$error":"#DIV/0!"}},{"$f":"SUM(O7:O34)/дети!G2","v":{"$error":"#DIV/0!"}},{"$f":"SUM(P7:P34)/дети!G2","v":{"$error":"#DIV/0!"}}]
[null,"\"3\" Сформирован (В)",{"$f":"COUNTIF(C7:C34,\"=3\")/дети!G2","v":{"$error":"#DIV/0!"}},{"$f":"COUNTIF(D7:D34,\"=3\")/дети!G2","v":{"$error":"#DIV/0!"}},{"$f":"COUNTIF(E7:E34,\"=3\")/дети!G2","v":{"$error":"#DIV/0!"}},{"$f":"COUNTIF(F7:F34,\"=3\")/дети!G2","v":{"$error":"#DIV/0!"}},{"$f":"COUNTIF(G7:G34,\"=3\")/дети!G2","v":{"$error":"#DIV/0!"}},{"$f":"COUNTIF(H7:H34,\"=3\")/дети!G2","v":{"$error":"#DIV/0!"}},{"$f":"COUNTIF(I7:I34,\"=3\")/дети!G2","v":{"$error":"#DIV/0!"}},{"$f":"COUNTIF(J7:J34,\"=3\")/дети!G2","v":{"$error":"#DIV/0!"}},{"$f":"COUNTIF(K7:K34,\"=3\")/дети!G2","v":{"$error":"#DIV/0!"}},{"$f":"COUNTIF(L7:L34,\"=3\")/дети!G2","v":{"$error":"#DIV/0!"}},{"$f":"COUNTIF(M7:M34,\"=3\")/дети!G2","v":{"$error":"#DIV/0!"}},{"$f":"COUNTIF(N7:N34,\"=3\")/дети!G2","v":{"$error":"#DIV/0!"}},{"$f":"COUNTIF(O7:O34,\"=3\")/дети!G2","v":{"$error":"#DIV/0!"}},{"$f":"COUNTIF(P7:P34,\"=3\")/дети!G2","v":{"$error":"#DIV/0!"}}]
[null,"\"2\" Находится в стадии формирования (С)",{"$f":"COUNTIF(C7:C34,\"=2\")/дети!G2","v":{"$error":"#DIV/0!"}},{"$f":"COUNTIF(D7:D34,\"=2\")/дети!G2","v":{"$error":"#DIV/0!"}},{"$f":"COUNTIF(E7:E34,\"=2\")/дети!G2","v":{"$error":"#DIV/0!"}},{"$f":"COUNTIF(F7:F34,\"=2\")/дети!G2","v":{"$error":"#DIV/0!"}},{"$f":"COUNTIF(G7:G34,\"=2\")/дети!G2","v":{"$error":"#DIV/0!"}},{"$f":"COUNTIF(H7:H34,\"=2\")/дети!G2","v":{"$error":"#DIV/0!"}},{"$f":"COUNTIF(I7:I34,\"=2\")/дети!G2","v":{"$error":"#DIV/0!"}},{"$f":"COUNTIF(J7:J34,\"=2\")/дети!G2","v":{"$error":"#DIV/0!"}},{"$f":"COUNTIF(K7:K34,\"=2\")/дети!G2","v":{"$error":"#DIV/0!"}},{"$f":"COUNTIF(L7:L34,\"=2\")/дети!G2","v":{"$error":"#DIV/0!"}},{"$f":"COUNTIF(M7:M34,\"=2\")/дети!G2","v":{"$error":"#DIV/0!"}},{"$f":"COUNTIF(N7:N34,\"=2\")/дети!G2","v":{"$error":"#DIV/0!"}},{"$f":"100%-(O38+O36)","v":{"$error":"#DIV/0!"}},{"$f":"100%-(P38+P36)","v":{"$error":"#DIV/0!"}}]
[null,"\"1\" Не сформирован (НС)",{"$f":"COUNTIF(C7:C34,\"=1\")/дети!G2","v":{"$error":"#DIV/0!"}},{"$f":"COUNTIF(D7:D34,\"=1\")/дети!G2","v":{"$error":"#DIV/0!"}},{"$f":"COUNTIF(E7:E34,\"=1\")/дети!G2","v":{"$error":"#DIV/0!"}},{"$f":"COUNTIF(F7:F34,\"=1\")/дети!G2","v":{"$error":"#DIV/0!"}},{"$f":"COUNTIF(G7:G34,\"=1\")/дети!G2","v":{"$error":"#DIV/0!"}},{"$f":"COUNTIF(H7:H34,\"=1\")/дети!G2","v":{"$error":"#DIV/0!"}},{"$f":"COUNTIF(I7:I34,\"=1\")/дети!G2","v":{"$error":"#DIV/0!"}},{"$f":"COUNTIF(J7:J34,\"=1\")/дети!G2","v":{"$error":"#DIV/0!"}},{"$f":"COUNTIF(K7:K34,\"=1\")/дети!G2","v":{"$error":"#DIV/0!"}},{"$f":"COUNTIF(L7:L34,\"=1\")/дети!G2","v":{"$error":"#DIV/0!"}},{"$f":"COUNTIF(M7:M34,\"=1\")/дети!G2","v":{"$error":"#DIV/0!"}},{"$f":"COUNTIF(N7:N34,\"=1\")/дети!G2","v":{"$error":"#DIV/0!"}},{"$f":"COUNTIF(O7:O34,\"<2\")/дети!G2","v":{"$error":"#DIV/0!"}},{"$f":"COUNTIF(P7:P34,\"<2\")/дети!G2","v":{"$error":"#DIV/0!"}}]

{"sheet":"соц-ком","index":2,"n_rows":39,"n_cols":22,"rows_kept":39,"merged":[[0,0,0,21],[4,0,6,0],[4,1,6,1],[4,2,5,3],[4,4,5,5],[4,6,5,7],[4,8,5,9],[4,10,5,11],[4,12,5,13],[4,14,5,15],[4,16,5,17],[4,18,5,19],[4,20,5,21],[35,0,35,1]]}
[{"$f":"дети!A30","v":"Мониторинг образовательного процесса группы №___ (подготовительная)  на  20___-20___ уч год"}]
[null,{"$f":"дети!A31","v":"Воспитатель: ____________"}]
[null,{"$f":"дети!A32","v":"Воспитатель: ______________"}]
[null,null,"Образовательная область «Социально-коммуникативное развитие»  "]
["№ п/ п","Фамилия, имя ребенка","Соблюдает элементарные правила организованного поведения в детском саду, на улице, в транспорте",null,"Знает и соблюдает элементарные правила поведения в природе (способы безопасного взаимодействия растениями и животными, бережного отношения к окружающей природе)",null,"Соблюдает элементарные правила дорожного движения, различает и называет специальные виды транспорта, объясняет их назначение, понимает значения сигналов светофора. Узнает и называет дорожные знаки",null,"Выполняет обязанности дежурного по столовой, в уголке природы",null,"Самостоятельно ухаживает за одеждой, устраняет неполадки во внешнем виде",null,"Самостоятельно выбирает и придумывает сюжеты игр, договаривается и принимает роль в игре со сверстниками, соблюдает ролевое поведение, проявляет инициативу в игре, обогащает сюжет",null,"Оценивает свои возможности, соблюдает правила и преодолевает трудности в дидактических играх, может объяснить сверстникам правила игры",null,"Моделирует предметно-игровую среду, проявляет интерес к театрализованной деятельности",null,"Итоговый показатель по каждому ребенку ",null,"Уровень"]
[]
[null,null,"н.г.","к.г.","н.г.","к.г.","н.г.","к.г.","н.г.","к.г.","н.г.","к.г.","н.г.","к.г.","н.г.","к.г.","н.г.","к.г.","н.г.","к.г.","н.г.","к.г."]
[1,{"$f":"дети!A1","v":0},{"v":0,"d":"0.0"},{"v":0,"d":"0.0"},{"v":0,"d":"0.0"},{"v":0,"d":"0.0"},{"v":0,"d":"0.0"},{"v":0,"d":"0.0"},{"v":0,"d":"0.0"},{"v":0,"d":"0.0"},{"v":0,"d":"0.0"},{"v":0,"d":"0.0"},{"v":0,"d":"0.0"},{"v":0,"d":"0.0"},{"v":0,"d":"0.0"},{"v":0,"d":"0.0"},{"v":0,"d":"0.0"},{"v":0,"d":"0.0"},{"$f":"(C8+E8+G8+I8+K8+M8+O8+Q8)/8","v":{"v":0,"d":"0.0"}},{"$f":"(D8+F8+H8+J8+L8+N8+P8+R8)/8","v":{"v":0,"d":"0.0"}},{"$f":"IF(S8=3,\"B\",IF(S8>=2,\"C\",\"HC\"))","v":"HC"},{"$f":"IF(T8=3,\"B\",IF(T8>=2,\"C\",\"HC\"))","v":"HC"}]
[2,{"$f":"дети!A2","v":0},{"v":0,"d":"0.0"},{"v":0,"d":"0.0"},{"v":0,"d":"0.0"},{"v":0,"d":"0.0"},{"v":0,"d":"0.0"},{"v":0,"d":"0.0"},{"v":0,"d":"0.0"},{"v":0,"d":"0.0"},{"v":0,"d":"0.0"},{"v":0,"d":"0.0"},{"v":0,"d":"0.0"},{"v":0,"d":"0.0"},{"v":0,"d":"0.0"},{"v":0,"d":"0.0"},{"v":0,"d":"0.0"},{"v":0,"d":"0.0"},{"$f":"(C9+E9+G9+I9+K9+M9+O9+Q9)/8","v":{"v":0,"d":"0.0"}},{"$f":"(D9+F9+H9+J9+L9+N9+P9+R9)/8","v":{"v":0,"d":"0.0"}},{"$f":"IF(S9=3,\"B\",IF(S9>=2,\"C\",\"HC\"))","v":"HC"},{"$f":"IF(T9=3,\"B\",IF(T9>=2,\"C\",\"HC\"))","v":"HC"}]
[3,{"$f":"дети!A3","v":0},{"v":0,"d":"0.0"},{"v":0,"d":"0.0"},{"v":0,"d":"0.0"},{"v":0,"d":"0.0"},{"v":0,"d":"0.0"},{"v":0,"d":"0.0"},{"v":0,"d":"0.0"},{"v":0,"d":"0.0"},{"v":0,"d":"0.0"},{"v":0,"d":"0.0"},{"v":0,"d":"0.0"},{"v":0,"d":"0.0"},{"v":0,"d":"0.0"},{"v":0,"d":"0.0"},{"v":0,"d":"0.0"},{"v":0,"d":"0.0"},{"v":0,"d":"0.0"},{"v":0,"d":"0.0"},"HC","HC"]
[4,{"$f":"дети!A4","v":0},{"v":0,"d":"0.0"},{"v":0,"d":"0.0"},{"v":0,"d":"0.0"},{"v":0,"d":"0.0"},{"v":0,"d":"0.0"},{"v":0,"d":"0.0"},{"v":0,"d":"0.0"},{"v":0,"d":"0.0"},{"v":0,"d":"0.0"},{"v":0,"d":"0.0"},{"v":0,"d":"0.0"},{"v":0,"d":"0.0"},{"v":0,"d":"0.0"},{"v":0,"d":"0.0"},{"v":0,"d":"0.0"},{"v":0,"d":"0.0"},{"v":0,"d":"0.0"},{"v":0,"d":"0.0"},"HC","HC"]
[5,{"$f":"дети!A5","v":0},{"v":0,"d":"0.0"},{"v":0,"d":"0.0"},{"v":0,"d":"0.0"},{"v":0,"d":"0.0"},{"v":0,"d":"0.0"},{"v":0,"d":"0.0"},{"v":0,"d":"0.0"},{"v":0,"d":"0.0"},{"v":0,"d":"0.0"},{"v":0,"d":"0.0"},{"v":0,"d":"0.0"},{"v":0,"d":"0.0"},{"v":0,"d":"0.0"},{"v":0,"d":"0.0"},{"v":0,"d":"0.0"},{"v":0,"d":"0.0"},{"v":0,"d":"0.0"},{"v":0,"d":"0.0"},"HC","HC"]
[6,{"$f":"дети!A6","v":0},{"v":0,"d":"0.0"},{"v":0,"d":"0.0"},{"v":0,"d":"0.0"},{"v":0,"d":"0.0"},{"v":0,"d":"0.0"},{"v":0,"d":"0.0"},{"v":0,"d":"0.0"},{"v":0,"d":"0.0"},{"v":0,"d":"0.0"},{"v":0,"d":"0.0"},{"v":0,"d":"0.0"},{"v":0,"d":"0.0"},{"v":0,"d":"0.0"},{"v":0,"d":"0.0"},{"v":0,"d":"0.0"},{"v":0,"d":"0.0"},{"v":0,"d":"0.0"},{"v":0,"d":"0.0"},"HC","HC"]
[7,{"$f":"дети!A7","v":0},{"v":0,"d":"0.0"},{"v":0,"d":"0.0"},{"v":0,"d":"0.0"},{"v":0,"d":"0.0"},{"v":0,"d":"0.0"},{"v":0,"d":"0.0"},{"v":0,"d":"0.0"},{"v":0,"d":"0.0"},{"v":0,"d":"0.0"},{"v":0,"d":"0.0"},{"v":0,"d":"0.0"},{"v":0,"d":"0.0"},{"v":0,"d":"0.0"},{"v":0,"d":"0.0"},{"v":0,"d":"0.0"},{"v":0,"d":"0.0"},{"v":0,"d":"0.0"},{"v":0,"d":"0.0"},"HC","HC"]
[8,{"$f":"дети!A8","v":0},{"v":0,"d":"0.0"},{"v":0,"d":"0.0"},{"v":0,"d":"0.0"},{"v":0,"d":"0.0"},{"v":0,"d":"0.0"},{"v":0,"d":"0.0"},{"v":0,"d":"0.0"},{"v":0,"d":"0.0"},{"v":0,"d":"0.0"},{"v":0,"d":"0.0"},{"v":0,"d":"0.0"},{"v":0,"d":"0.0"},{"v":0,"d":"0.0"},{"v":0,"d":"0.0"},{"v":0,"d":"0.0"},{"v":0,"d":"0.0"},{"v":0,"d":"0.0"},{"v":0,"d":"0.0"},"HC","HC"]
[9,{"$f":"дети!A9","v":0},{"v":0,"d":"0.0"},{"v":0,"d":"0.0"},{"v":0,"d":"0.0"},{"v":0,"d":"0.0"},{"v":0,"d":"0.0"},{"v":0,"d":"0.0"},{"v":0,"d":"0.0"},{"v":0,"d":"0.0"},{"v":0,"d":"0.0"},{"v":0,"d":"0.0"},{"v":0,"d":"0.0"},{"v":0,"d":"0.0"},{"v":0,"d":"0.0"},{"v":0,"d":"0.0"},{"v":0,"d":"0.0"},{"v":0,"d":"0.0"},{"v":0,"d":"0.0"},{"v":0,"d":"0.0"},"HC","HC"]
[10,{"$f":"дети!A10","v":0},{"v":0,"d":"0.0"},{"v":0,"d":"0.0"},{"v":0,"d":"0.0"},{"v":0,"d":"0.0"},{"v":0,"d":"0.0"},{"v":0,"d":"0.0"},{"v":0,"d":"0.0"},{"v":0,"d":"0.0"},{"v":0,"d":"0.0"},{"v":0,"d":"0.0"},{"v":0,"d":"0.0"},{"v":0,"d":"0.0"},{"v":0,"d":"0.0"},{"v":0,"d":"0.0"},{"v":0,"d":"0.0"},{"v":0,"d":"0.0"},{"v":0,"d":"0.0"},{"v":0,"d":"0.0"},"HC","HC"]
[11,{"$f":"дети!A11","v":0},{"v":0,"d":"0.0"},{"v":0,"d":"0.0"},{"v":0,"d":"0.0"},{"v":0,"d":"0.0"},{"v":0,"d":"0.0"},{"v":0,"d":"0.0"},{"v":0,"d":"0.0"},{"v":0,"d":"0.0"},{"v":0,"d":"0.0"},{"v":0,"d":"0.0"},{"v":0,"d":"0.0"},{"v":0,"d":"0.0"},{"v":0,"d":"0.0"},{"v":0,"d":"0.0"},{"v":0,"d":"0.0"},{"v":0,"d":"0.0"},{"v":0,"d":"0.0"},{"v":0,"d":"0.0"},"HC","HC"]
[12,{"$f":"дети!A12","v":0},{"v":0,"d":"0.0"},{"v":0,"d":"0.0"},{"v":0,"d":"0.0"},{"v":0,"d":"0.0"},{"v":0,"d":"0.0"},{"v":0,"d":"0.0"},{"v":0,"d":"0.0"},{"v":0,"d":"0.0"},{"v":0,"d":"0.0"},{"v":0,"d":"0.0"},{"v":0,"d":"0.0"},{"v":0,"d":"0.0"},{"v":0,"d":"0.0"},{"v":0,"d":"0.0"},{"v":0,"d":"0.0"},{"v":0,"d":"0.0"},{"v":0,"d":"0.0"},{"v":0,"d":"0.0"},"HC","HC"]
[13,{"$f":"дети!A13","v":0},{"v":0,"d":"0.0"},{"v":0,"d":"0.0"},{"v":0,"d":"0.0"},{"v":0,"d":"0.0"},{"v":0,"d":"0.0"},{"v":0,"d":"0.0"},{"v":0,"d":"0.0"},{"v":0,"d":"0.0"},{"v":0,"d":"0.0"},{"v":0,"d":"0.0"},{"v":0,"d":"0.0"},{"v":0,"d":"0.0"},{"v":0,"d":"0.0"},{"v":0,"d":"0.0"},{"v":0,"d":"0.0"},{"v":0,"d":"0.0"},{"v":0,"d":"0.0"},{"v":0,"d":"0.0"},"HC","HC"]
[14,{"$f":"дети!A14","v":0},{"v":0,"d":"0.0"},{"v":0,"d":"0.0"},{"v":0,"d":"0.0"},{"v":0,"d":"0.0"},{"v":0,"d":"0.0"},{"v":0,"d":"0.0"},{"v":0,"d":"0.0"},{"v":0,"d":"0.0"},{"v":0,"d":"0.0"},{"v":0,"d":"0.0"},{"v":0,"d":"0.0"},{"v":0,"d":"0.0"},{"v":0,"d":"0.0"},{"v":0,"d":"0.0"},{"v":0,"d":"0.0"},{"v":0,"d":"0.0"},{"v":0,"d":"0.0"},{"v":0,"d":"0.0"},"HC","HC"]
[15,{"$f":"дети!A15","v":0},{"v":0,"d":"0.0"},{"v":0,"d":"0.0"},{"v":0,"d":"0.0"},{"v":0,"d":"0.0"},{"v":0,"d":"0.0"},{"v":0,"d":"0.0"},{"v":0,"d":"0.0"},{"v":0,"d":"0.0"},{"v":0,"d":"0.0"},{"v":0,"d":"0.0"},{"v":0,"d":"0.0"},{"v":0,"d":"0.0"},{"v":0,"d":"0.0"},{"v":0,"d":"0.0"},{"v":0,"d":"0.0"},{"v":0,"d":"0.0"},{"v":0,"d":"0.0"},{"v":0,"d":"0.0"},{"$f":"IF(S22=3,\"B\",IF(S22>=2,\"C\",\"HC\"))","v":"HC"},{"$f":"IF(T22=3,\"B\",IF(T22>=2,\"C\",\"HC\"))","v":"HC"}]
[16,{"$f":"дети!A16","v":0},{"v":0,"d":"0.0"},{"v":0,"d":"0.0"},{"v":0,"d":"0.0"},{"v":0,"d":"0.0"},{"v":0,"d":"0.0"},{"v":0,"d":"0.0"},{"v":0,"d":"0.0"},{"v":0,"d":"0.0"},{"v":0,"d":"0.0"},{"v":0,"d":"0.0"},{"v":0,"d":"0.0"},{"v":0,"d":"0.0"},{"v":0,"d":"0.0"},{"v":0,"d":"0.0"},{"v":0,"d":"0.0"},{"v":0,"d":"0.0"},{"v":0,"d":"0.0"},{"v":0,"d":"0.0"},"HC","HC"]
[17,{"$f":"дети!A17","v":0},{"v":0,"d":"0.0"},{"v":0,"d":"0.0"},{"v":0,"d":"0.0"},{"v":0,"d":"0.0"},{"v":0,"d":"0.0"},{"v":0,"d":"0.0"},{"v":0,"d":"0.0"},{"v":0,"d":"0.0"},{"v":0,"d":"0.0"},{"v":0,"d":"0.0"},{"v":0,"d":"0.0"},{"v":0,"d":"0.0"},{"v":0,"d":"0.0"},{"v":0,"d":"0.0"},{"v":0,"d":"0.0"},{"v":0,"d":"0.0"},{"v":0,"d":"0.0"},{"v":0,"d":"0.0"},"HC","HC"]
[18,{"$f":"дети!A18","v":0},{"v":0,"d":"0.0"},{"v":0,"d":"0.0"},{"v":0,"d":"0.0"},{"v":0,"d":"0.0"},{"v":0,"d":"0.0"},{"v":0,"d":"0.0"},{"v":0,"d":"0.0"},{"v":0,"d":"0.0"},{"v":0,"d":"0.0"},{"v":0,"d":"0.0"},{"v":0,"d":"0.0"},{"v":0,"d":"0.0"},{"v":0,"d":"0.0"},{"v":0,"d":"0.0"},{"v":0,"d":"0.0"},{"v":0,"d":"0.0"},{"v":0,"d":"0.0"},{"v":0,"d":"0.0"},"HC","HC"]
[19,{"$f":"дети!A19","v":0},{"v":0,"d":"0.0"},{"v":0,"d":"0.0"},{"v":0,"d":"0.0"},{"v":0,"d":"0.0"},{"v":0,"d":"0.0"},{"v":0,"d":"0.0"},{"v":0,"d":"0.0"},{"v":0,"d":"0.0"},{"v":0,"d":"0.0"},{"v":0,"d":"0.0"},{"v":0,"d":"0.0"},{"v":0,"d":"0.0"},{"v":0,"d":"0.0"},{"v":0,"d":"0.0"},{"v":0,"d":"0.0"},{"v":0,"d":"0.0"},{"v":0,"d":"0.0"},{"v":0,"d":"0.0"},"HC","HC"]
[20,{"$f":"дети!A20","v":0},{"v":0,"d":"0.0"},{"v":0,"d":"0.0"},{"v":0,"d":"0.0"},{"v":0,"d":"0.0"},{"v":0,"d":"0.0"},{"v":0,"d":"0.0"},{"v":0,"d":"0.0"},{"v":0,"d":"0.0"},{"v":0,"d":"0.0"},{"v":0,"d":"0.0"},{"v":0,"d":"0.0"},{"v":0,"d":"0.0"},{"v":0,"d":"0.0"},{"v":0,"d":"0.0"},{"v":0,"d":"0.0"},{"v":0,"d":"0.0"},{"v":0,"d":"0.0"},{"v":0,"d":"0.0"},"HC","HC"]
[21,{"$f":"дети!A21","v":0},{"v":0,"d":"0.0"},{"v":0,"d":"0.0"},{"v":0,"d":"0.0"},{"v":0,"d":"0.0"},{"v":0,"d":"0.0"},{"v":0,"d":"0.0"},{"v":0,"d":"0.0"},{"v":0,"d":"0.0"},{"v":0,"d":"0.0"},{"v":0,"d":"0.0"},{"v":0,"d":"0.0"},{"v":0,"d":"0.0"},{"v":0,"d":"0.0"},{"v":0,"d":"0.0"},{"v":0,"d":"0.0"},{"v":0,"d":"0.0"},{"v":0,"d":"0.0"},{"v":0,"d":"0.0"},"HC","HC"]
[22,{"$f":"дети!A22","v":0},{"v":0,"d":"0.0"},{"v":0,"d":"0.0"},{"v":0,"d":"0.0"},{"v":0,"d":"0.0"},{"v":0,"d":"0.0"},{"v":0,"d":"0.0"},{"v":0,"d":"0.0"},{"v":0,"d":"0.0"},{"v":0,"d":"0.0"},{"v":0,"d":"0.0"},{"v":0,"d":"0.0"},{"v":0,"d":"0.0"},{"v":0,"d":"0.0"},{"v":0,"d":"0.0"},{"v":0,"d":"0.0"},{"v":0,"d":"0.0"},{"v":0,"d":"0.0"},{"v":0,"d":"0.0"},"HC","HC"]
[23,{"$f":"дети!A23","v":0},{"v":0,"d":"0.0"},{"v":0,"d":"0.0"},{"v":0,"d":"0.0"},{"v":0,"d":"0.0"},{"v":0,"d":"0.0"},{"v":0,"d":"0.0"},{"v":0,"d":"0.0"},{"v":0,"d":"0.0"},{"v":0,"d":"0.0"},{"v":0,"d":"0.0"},{"v":0,"d":"0.0"},{"v":0,"d":"0.0"},{"v":0,"d":"0.0"},{"v":0,"d":"0.0"},{"v":0,"d":"0.0"},{"v":0,"d":"0.0"},{"v":0,"d":"0.0"},{"v":0,"d":"0.0"},"HC","HC"]
[24,{"$f":"дети!A24","v":0},{"v":0,"d":"0.0"},{"v":0,"d":"0.0"},{"v":0,"d":"0.0"},{"v":0,"d":"0.0"},{"v":0,"d":"0.0"},{"v":0,"d":"0.0"},{"v":0,"d":"0.0"},{"v":0,"d":"0.0"},{"v":0,"d":"0.0"},{"v":0,"d":"0.0"},{"v":0,"d":"0.0"},{"v":0,"d":"0.0"},{"v":0,"d":"0.0"},{"v":0,"d":"0.0"},{"v":0,"d":"0.0"},{"v":0,"d":"0.0"},{"v":0,"d":"0.0"},{"v":0,"d":"0.0"},"HC","HC"]
[25,{"$f":"дети!A25","v":0},{"v":0,"d":"0.0"},{"v":0,"d":"0.0"},{"v":0,"d":"0.0"},{"v":0,"d":"0.0"},{"v":0,"d":"0.0"},{"v":0,"d":"0.0"},{"v":0,"d":"0.0"},{"v":0,"d":"0.0"},{"v":0,"d":"0.0"},{"v":0,"d":"0.0"},{"v":0,"d":"0.0"},{"v":0,"d":"0.0"},{"v":0,"d":"0.0"},{"v":0,"d":"0.0"},{"v":0,"d":"0.0"},{"v":0,"d":"0.0"},{"v":0,"d":"0.0"},{"v":0,"d":"0.0"},"HC","HC"]
[26,{"$f":"дети!A26","v":0},{"v":0,"d":"0.0"},{"v":0,"d":"0.0"},{"v":0,"d":"0.0"},{"v":0,"d":"0.0"},{"v":0,"d":"0.0"},{"v":0,"d":"0.0"},{"v":0,"d":"0.0"},{"v":0,"d":"0.0"},{"v":0,"d":"0.0"},{"v":0,"d":"0.0"},{"v":0,"d":"0.0"},{"v":0,"d":"0.0"},{"v":0,"d":"0.0"},{"v":0,"d":"0.0"},{"v":0,"d":"0.0"},{"v":0,"d":"0.0"},{"v":0,"d":"0.0"},{"v":0,"d":"0.0"},"HC","HC"]
[27,{"$f":"дети!A27","v":0},{"v":0,"d":"0.0"},{"v":0,"d":"0.0"},{"v":0,"d":"0.0"},{"v":0,"d":"0.0"},{"v":0,"d":"0.0"},{"v":0,"d":"0.0"},{"v":0,"d":"0.0"},{"v":0,"d":"0.0"},{"v":0,"d":"0.0"},{"v":0,"d":"0.0"},{"v":0,"d":"0.0"},{"v":0,"d":"0.0"},{"v":0,"d":"0.0"},{"v":0,"d":"0.0"},{"v":0,"d":"0.0"},{"v":0,"d":"0.0"},{"v":0,"d":"0.0"},{"v":0,"d":"0.0"},"HC","HC"]
[28,{"$f":"дети!A28","v":0},{"v":0,"d":"0.0"},{"v":0,"d":"0.0"},{"v":0,"d":"0.0"},{"v":0,"d":"0.0"},{"v":0,"d":"0.0"},{"v":0,"d":"0.0"},{"v":0,"d":"0.0"},{"v":0,"d":"0.0"},{"v":0,"d":"0.0"},{"v":0,"d":"0.0"},{"v":0,"d":"0.0"},{"v":0,"d":"0.0"},{"v":0,"d":"0.0"},{"v":0,"d":"0.0"},{"v":0,"d":"0.0"},{"v":0,"d":"0.0"},{"v":0,"d":"0.0"},{"v":0,"d":"0.0"},"HC","HC"]
["Итоговый показатель по группе (ср.значение)",null,{"$f":"SUM(C8:C35)/дети!G2","v":{"$error":"#DIV/0!"}},{"$f":"SUM(D8:D35)/дети!G2","v":{"$error":"#DIV/0!"}},{"$f":"SUM(E8:E35)/дети!G2","v":{"$error":"#DIV/0!"}},{"$f":"SUM(F8:F35)/дети!G2","v":{"$error":"#DIV/0!"}},{"$f":"SUM(G8:G35)/дети!G2","v":{"$error":"#DIV/0!"}},{"$f":"SUM(H8:H35)/дети!G2","v":{"$error":"#DIV/0!"}},{"$f":"SUM(I8:I35)/дети!G2","v":{"$error":"#DIV/0!"}},{"$f":"SUM(J8:J35)/дети!G2","v":{"$error":"#DIV/0!"}},{"$f":"SUM(K8:K35)/дети!G2","v":{"$error":"#DIV/0!"}},{"$f":"SUM(L8:L35)/дети!G2","v":{"$error":"#DIV/0!"}},{"$f":"SUM(M8:M35)/дети!G2","v":{"$error":"#DIV/0!"}},{"$f":"SUM(N8:N35)/дети!G2","v":{"$error":"#DIV/0!"}},{"$f":"SUM(O8:O35)/дети!G2","v":{"$error":"#DIV/0!"}},{"$f":"SUM(P8:P35)/дети!G2","v":{"$error":"#DIV/0!"}},{"$f":"SUM(Q8:Q35)/дети!G2","v":{"$error":"#DIV/0!"}},{"$f":"SUM(R8:R35)/дети!G2","v":{"$error":"#DIV/0!"}},{"$f":"SUM(S8:S35)/дети!G2","v":{"$error":"#DIV/0!"}},{"$f":"SUM(T8:T35)/дети!G2","v":{"$error":"#DIV/0!"}},{"$f":"SUM(U8:U35)/23","v":0},{"$f":"SUM(V8:V35)/23","v":0}]
[null,"\"3\" Сформирован (В)",{"$f":"COUNTIF(C8:C35,\"=3\")/дети!G2","v":{"$error":"#DIV/0!"}},{"$f":"COUNTIF(D8:D35,\"=3\")/дети!G2","v":{"$error":"#DIV/0!"}},{"$f":"COUNTIF(E8:E35,\"=3\")/дети!G2","v":{"$error":"#DIV/0!"}},{"$f":"COUNTIF(F8:F35,\"=3\")/дети!G2","v":{"$error":"#DIV/0!"}},{"$f":"COUNTIF(G8:G35,\"=3\")/дети!G2","v":{"$error":"#DIV/0!"}},{"$f":"COUNTIF(H8:H35,\"=3\")/дети!G2","v":{"$error":"#DIV/0!"}},{"$f":"COUNTIF(I8:I35,\"=3\")/дети!G2","v":{"$error":"#DIV/0!"}},{"$f":"COUNTIF(J8:J35,\"=3\")/дети!G2","v":{"$error":"#DIV/0!"}},{"$f":"COUNTIF(K8:K35,\"=3\")/дети!G2","v":{"$error":"#DIV/0!"}},{"$f":"COUNTIF(L8:L35,\"=3\")/дети!G2","v":{"$error":"#DIV/0!"}},{"$f":"COUNTIF(M8:M35,\"=3\")/дети!G2","v":{"$error":"#DIV/0!"}},{"$f":"COUNTIF(N8:N35,\"=3\")/дети!G2","v":{"$error":"#DIV/0!"}},{"$f":"COUNTIF(O8:O35,\"=3\")/дети!G2","v":{"$error":"#DIV/0!"}},{"$f":"COUNTIF(P8:P35,\"=3\")/дети!G2","v":{"$error":"#DIV/0!"}},{"$f":"COUNTIF(Q8:Q35,\"=3\")/дети!G2","v":{"$error":"#DIV/0!"}},{"$f":"COUNTIF(R8:R35,\"=3\")/дети!G2","v":{"$error":"#DIV/0!"}},{"$f":"COUNTIF(S8:S35,\"=3\")/дети!G2","v":{"$error":"#DIV/0!"}},{"$f":"COUNTIF(T8:T35,\"=3\")/дети!G2","v":{"$error":"#DIV/0!"}}]
[null,"\"2\" Находится в стадии формирования (С)",{"$f":"COUNTIF(C8:C35,\"=2\")/дети!G2","v":{"$error":"#DIV/0!"}},{"$f":"COUNTIF(D8:D35,\"=2\")/дети!G2","v":{"$error":"#DIV/0!"}},{"$f":"COUNTIF(E8:E35,\"=2\")/дети!G2","v":{"$error":"#DIV/0!"}},{"$f":"COUNTIF(F8:F35,\"=2\")/дети!G2","v":{"$error":"#DIV/0!"}},{"$f":"COUNTIF(G8:G35,\"=2\")/дети!G2","v":{"$error":"#DIV/0!"}},{"$f":"COUNTIF(H8:H35,\"=2\")/дети!G2","v":{"$error":"#DIV/0!"}},{"$f":"COUNTIF(I8:I35,\"=2\")/дети!G2","v":{"$error":"#DIV/0!"}},{"$f":"COUNTIF(J8:J35,\"=2\")/дети!G2","v":{"$error":"#DIV/0!"}},{"$f":"COUNTIF(K8:K35,\"=2\")/дети!G2","v":{"$error":"#DIV/0!"}},{"$f":"COUNTIF(L8:L35,\"=2\")/дети!G2","v":{"$error":"#DIV/0!"}},{"$f":"COUNTIF(M8:M35,\"=2\")/дети!G2","v":{"$error":"#DIV/0!"}},{"$f":"COUNTIF(N8:N35,\"=2\")/дети!G2","v":{"$error":"#DIV/0!"}},{"$f":"COUNTIF(O8:O35,\"=2\")/дети!G2","v":{"$error":"#DIV/0!"}},{"$f":"COUNTIF(P8:P35,\"=2\")/дети!G2","v":{"$error":"#DIV/0!"}},{"$f":"COUNTIF(Q8:Q35,\"=2\")/дети!G2","v":{"$error":"#DIV/0!"}},{"$f":"COUNTIF(R8:R35,\"=2\")/дети!G2","v":{"$error":"#DIV/0!"}},{"$f":"100%-(S39+S37)","v":{"$error":"#DIV/0!"}},{"$f":"100%-(T39+T37)","v":{"$error":"#DIV/0!"}}]
[null,"\"1\" Не сформирован (НС)",{"$f":"COUNTIF(C8:C35,\"=1\")/дети!G2","v":{"$error":"#DIV/0!"}},{"$f":"COUNTIF(D8:D35,\"=1\")/дети!G2","v":{"$error":"#DIV/0!"}},{"$f":"COUNTIF(E8:E35,\"=1\")/дети!G2","v":{"$error":"#DIV/0!"}},{"$f":"COUNTIF(F8:F35,\"=1\")/дети!G2","v":{"$error":"#DIV/0!"}},{"$f":"COUNTIF(G8:G35,\"=1\")/дети!G2","v":{"$error":"#DIV/0!"}},{"$f":"COUNTIF(H8:H35,\"=1\")/дети!G2","v":{"$error":"#DIV/0!"}},{"$f":"COUNTIF(I8:I35,\"=1\")/дети!G2","v":{"$error":"#DIV/0!"}},{"$f":"COUNTIF(J8:J35,\"=1\")/дети!G2","v":{"$error":"#DIV/0!"}},{"$f":"COUNTIF(K8:K35,\"=1\")/дети!G2","v":{"$error":"#DIV/0!"}},{"$f":"COUNTIF(L8:L35,\"=1\")/дети!G2","v":{"$error":"#DIV/0!"}},{"$f":"COUNTIF(M8:M35,\"=1\")/дети!G2","v":{"$error":"#DIV/0!"}},{"$f":"COUNTIF(N8:N35,\"=1\")/дети!G2","v":{"$error":"#DIV/0!"}},{"$f":"COUNTIF(O8:O35,\"=1\")/дети!G2","v":{"$error":"#DIV/0!"}},{"$f":"COUNTIF(P8:P35,\"=1\")/дети!G2","v":{"$error":"#DIV/0!"}},{"$f":"COUNTIF(Q8:Q35,\"=1\")/дети!G2","v":{"$error":"#DIV/0!"}},{"$f":"COUNTIF(R8:R35,\"=1\")/дети!G2","v":{"$error":"#DIV/0!"}},{"$f":"COUNTIF(S8:S35,\"<2\")/дети!G2","v":{"$error":"#DIV/0!"}},{"$f":"COUNTIF(T8:T35,\"<2\")/дети!G2","v":{"$error":"#DIV/0!"}}]

{"sheet":"познават","index":3,"n_rows":38,"n_cols":22,"rows_kept":38,"merged":[[4,0,5,0],[4,1,5,1],[4,2,4,3],[4,4,4,5],[4,6,4,7],[4,8,4,9],[4,10,4,11],[4,12,4,13],[4,14,4,15],[4,16,4,17],[4,18,4,19],[34,0,34,1]]}
[null,null,{"$f":"дети!A30","v":"Мониторинг образовательного процесса группы №___ (подготовительная)  на  20___-20___ уч год"}]
[null,{"$f":"дети!A31","v":"Воспитатель: ____________"}]
[null,{"$f":"дети!A32","v":"Воспитатель: ______________"}]
[{"$nulls":3},"Образовательная область «Познавательное развитие»  "]
["№п/п","Фамилия, имя ребенка","Знает и называет зверей, птиц, пресмыкающихся, земноводных, насекомых",null,"Знает герб, флаг, гимн России, столицу, достопримечательности род-ного края",null,"Знает количественный и порядковый счет в пределах 20, состав числа до 10 из единиц и из двух меньших (до 5)",null,"Составляет и решает задачи в 1 действие на сложение и вычитание, пользуется цифрами и арифметическими знаками",null,"Знает способы измерения величин: длины, объема, массы. Пользуется условной меркой",null,"Называет отрезок, угол, круг, овал, многоугольник, шар, куб, проводит их сравнение. Умеет делить фигуры на несколько частей и составлять целые",null,"Владеет временными понятиями: день-неделя-месяц, минута-час (по часам), последовательность времен года и дней недели",null,"Итоговый показатель по каждому ребенку (ср.значение)",null,"Уровень"]
[null,null,"н.г.","к.г.","н.г.","к.г.","н.г.","к.г.","н.г.","к.г.","н.г.","к.г.","н.г.","к.г.","н.г.","к.г.","н.г.","к.г.","н.г.","к.г."]
[1,{"$f":"дети!A1","v":0},0,0,0,0,0,0,0,0,0,0,0,0,0,0,{"$f":"(C7+E7+G7+I7+K7+M7+O7)/7","v":{"v":0,"d":"0.0"}},{"$f":"(D7+F7+H7+J7+L7+N7+P7)/7","v":{"v":0,"d":"0.0"}},{"$f":"IF(Q7=3,\"B\",IF(Q7>=2,\"C\",\"HC\"))","v":"HC"},{"$f":"IF(R7=3,\"B\",IF(R7>=2,\"C\",\"HC\"))","v":"HC"}]
[2,{"$f":"дети!A2","v":0},0,0,0,0,0,0,0,0,0,0,0,0,0,0,{"$f":"(C8+E8+G8+I8+K8+M8+O8)/7","v":{"v":0,"d":"0.0"}},{"$f":"(D8+F8+H8+J8+L8+N8+P8)/7","v":{"v":0,"d":"0.0"}},{"$f":"IF(Q8=3,\"B\",IF(Q8>=2,\"C\",\"HC\"))","v":"HC"},{"$f":"IF(R8=3,\"B\",IF(R8>=2,\"C\",\"HC\"))","v":"HC"}]
[3,{"$f":"дети!A3","v":0},0,0,0,0,0,0,0,0,0,0,0,0,0,0,{"v":0,"d":"0.0"},{"v":0,"d":"0.0"},"HC","HC"]
[4,{"$f":"дети!A4","v":0},0,0,0,0,0,0,0,0,0,0,0,0,0,0,{"v":0,"d":"0.0"},{"v":0,"d":"0.0"},"HC","HC"]
[5,{"$f":"дети!A5","v":0},0,0,0,0,0,0,0,0,0,0,0,0,0,0,{"v":0,"d":"0.0"},{"v":0,"d":"0.0"},"HC","HC"]
[6,{"$f":"дети!A6","v":0},0,0,0,0,0,0,0,0,0,0,0,0,0,0,{"v":0,"d":"0.0"},{"v":0,"d":"0.0"},"HC","HC"]
[7,{"$f":"дети!A7","v":0},0,0,0,0,0,0,0,0,0,0,0,0,0,0,{"v":0,"d":"0.0"},{"v":0,"d":"0.0"},"HC","HC"]
[8,{"$f":"дети!A8","v":0},0,0,0,0,0,0,0,0,0,0,0,0,0,0,{"v":0,"d":"0.0"},{"v":0,"d":"0.0"},"HC","HC"]
[9,{"$f":"дети!A9","v":0},0,0,0,0,0,0,0,0,0,0,0,0,0,0,{"v":0,"d":"0.0"},{"v":0,"d":"0.0"},"HC","HC"]
[10,{"$f":"дети!A10","v":0},0,0,0,0,0,0,0,0,0,0,0,0,0,0,{"v":0,"d":"0.0"},{"v":0,"d":"0.0"},"HC","HC"]
[11,{"$f":"дети!A11","v":0},0,0,0,0,0,0,0,0,0,0,0,0,0,0,{"v":0,"d":"0.0"},{"v":0,"d":"0.0"},"HC","HC"]
[12,{"$f":"дети!A12","v":0},0,0,0,0,0,0,0,0,0,0,0,0,0,0,{"v":0,"d":"0.0"},{"v":0,"d":"0.0"},"HC","HC"]
[13,{"$f":"дети!A13","v":0},0,0,0,0,0,0,0,0,0,0,0,0,0,0,{"v":0,"d":"0.0"},{"v":0,"d":"0.0"},"HC","HC"]
[14,{"$f":"дети!A14","v":0},0,0,0,0,0,0,0,0,0,0,0,0,0,0,{"v":0,"d":"0.0"},{"v":0,"d":"0.0"},"HC","HC"]
[15,{"$f":"дети!A15","v":0},0,0,0,0,0,0,0,0,0,0,0,0,0,0,{"v":0,"d":"0.0"},{"v":0,"d":"0.0"},{"$f":"IF(Q21=3,\"B\",IF(Q21>=2,\"C\",\"HC\"))","v":"HC"},{"$f":"IF(R21=3,\"B\",IF(R21>=2,\"C\",\"HC\"))","v":"HC"}]
[16,{"$f":"дети!A16","v":0},0,0,0,0,0,0,0,0,0,0,0,0,0,0,{"v":0,"d":"0.0"},{"v":0,"d":"0.0"},"HC","HC"]
[17,{"$f":"дети!A17","v":0},0,0,0,0,0,0,0,0,0,0,0,0,0,0,{"v":0,"d":"0.0"},{"v":0,"d":"0.0"},"HC","HC"]
[18,{"$f":"дети!A18","v":0},0,0,0,0,0,0,0,0,0,0,0,0,0,0,{"v":0,"d":"0.0"},{"v":0,"d":"0.0"},"HC","HC"]
[19,{"$f":"дети!A19","v":0},0,0,0,0,0,0,0,0,0,0,0,0,0,0,{"v":0,"d":"0.0"},{"v":0,"d":"0.0"},"HC","HC"]
[20,{"$f":"дети!A20","v":0},0,0,0,0,0,0,0,0,0,0,0,0,0,0,{"v":0,"d":"0.0"},{"v":0,"d":"0.0"},"HC","HC"]
[21,{"$f":"дети!A21","v":0},0,0,0,0,0,0,0,0,0,0,0,0,0,0,{"v":0,"d":"0.0"},{"v":0,"d":"0.0"},"HC","HC"]
[22,{"$f":"дети!A22","v":0},0,0,0,0,0,0,0,0,0,0,0,0,0,0,{"v":0,"d":"0.0"},{"v":0,"d":"0.0"},"HC","HC"]
[23,{"$f":"дети!A23","v":0},0,0,0,0,0,0,0,0,0,0,0,0,0,0,{"v":0,"d":"0.0"},{"v":0,"d":"0.0"},"HC","HC"]
[24,{"$f":"дети!A24","v":0},0,0,0,0,0,0,0,0,0,0,0,0,0,0,{"v":0,"d":"0.0"},{"v":0,"d":"0.0"},"HC","HC"]
[25,{"$f":"дети!A25","v":0},0,0,0,0,0,0,0,0,0,0,0,0,0,0,{"v":0,"d":"0.0"},{"v":0,"d":"0.0"},"HC","HC"]
[26,{"$f":"дети!A26","v":0},0,0,0,0,0,0,0,0,0,0,0,0,0,0,{"v":0,"d":"0.0"},{"v":0,"d":"0.0"},"HC","HC"]
[27,{"$f":"дети!A27","v":0},0,0,0,0,0,0,0,0,0,0,0,0,0,0,{"v":0,"d":"0.0"},{"v":0,"d":"0.0"},{"$f":"IF(Q33=3,\"B\",IF(Q33>=2,\"C\",\"HC\"))","v":"HC"},{"$f":"IF(R33=3,\"B\",IF(R33>=2,\"C\",\"HC\"))","v":"HC"}]
[28,{"$f":"дети!A28","v":0},0,0,0,0,0,0,0,0,0,0,0,0,0,0,{"v":0,"d":"0.0"},{"v":0,"d":"0.0"},{"$f":"IF(Q34=3,\"B\",IF(Q34>=2,\"C\",\"HC\"))","v":"HC"},{"$f":"IF(R34=3,\"B\",IF(R34>=2,\"C\",\"HC\"))","v":"HC"}]
["Итоговый пок-ль по группе (ср. значение)",null,{"$f":"SUM(C7:C34)/23","v":{"v":0,"d":"0.0"}},{"$f":"SUM(D7:D34)/23","v":{"v":0,"d":"0.0"}},{"$f":"SUM(E7:E34)/23","v":{"v":0,"d":"0.0"}},{"$f":"SUM(F7:F34)/23","v":{"v":0,"d":"0.0"}},{"$f":"SUM(G7:G34)/23","v":{"v":0,"d":"0.0"}},{"$f":"H7","v":{"v":0,"d":"0.0"}},{"$f":"SUM(I7:I34)/23","v":{"v":0,"d":"0.0"}},{"$f":"SUM(J7:J34)/23","v":{"v":0,"d":"0.0"}},{"$f":"SUM(K7:K34)/23","v":{"v":0,"d":"0.0"}},{"$f":"SUM(L7:L34)/23","v":{"v":0,"d":"0.0"}},{"$f":"SUM(M7:M34)/23","v":{"v":0,"d":"0.0"}},{"$f":"N18","v":{"v":0,"d":"0.0"}},{"$f":"SUM(O7:O34)/23","v":{"v":0,"d":"0.0"}},{"$f":"SUM(P7:P34)/23","v":{"v":0,"d":"0.0"}},{"$f":"SUM(Q7:Q34)/дети!G2","v":{"$error":"#DIV/0!"}},{"$f":"SUM(R7:R34)/дети!G2","v":{"$error":"#DIV/0!"}},{"$f":"SUM(S7:S34)/23","v":0},{"$f":"SUM(T7:T34)/23","v":0},null,"разделить на число детей"]
[null,"\"3\" Сформирован (В)",{"$f":"COUNTIF(C7:C34,\"=3\")/дети!G2","v":{"$error":"#DIV/0!"}},{"$f":"COUNTIF(D7:D34,\"=3\")/дети!G2","v":{"$error":"#DIV/0!"}},{"$f":"COUNTIF(E7:E34,\"=3\")/дети!G2","v":{"$error":"#DIV/0!"}},{"$f":"COUNTIF(F7:F34,\"=3\")/дети!G2","v":{"$error":"#DIV/0!"}},{"$f":"COUNTIF(G7:G34,\"=3\")/дети!G2","v":{"$error":"#DIV/0!"}},{"$f":"COUNTIF(H7:H34,\"=3\")/дети!G2","v":{"$error":"#DIV/0!"}},{"$f":"COUNTIF(I7:I34,\"=3\")/дети!G2","v":{"$error":"#DIV/0!"}},{"$f":"COUNTIF(J7:J34,\"=3\")/дети!G2","v":{"$error":"#DIV/0!"}},{"$f":"COUNTIF(K7:K34,\"=3\")/дети!G2","v":{"$error":"#DIV/0!"}},{"$f":"COUNTIF(L7:L34,\"=3\")/дети!G2","v":{"$error":"#DIV/0!"}},{"$f":"COUNTIF(M7:M34,\"=3\")/дети!G2","v":{"$error":"#DIV/0!"}},{"$f":"COUNTIF(N7:N34,\"=3\")/дети!G2","v":{"$error":"#DIV/0!"}},{"$f":"COUNTIF(O7:O34,\"=3\")/дети!G2","v":{"$error":"#DIV/0!"}},{"$f":"COUNTIF(P7:P34,\"=3\")/дети!G2","v":{"$error":"#DIV/0!"}},{"$f":"COUNTIF(Q7:Q34,\"=3\")/дети!G2","v":{"$error":"#DIV/0!"}},{"$f":"COUNTIF(R7:R34,\"=3\")/дети!G2","v":{"$error":"#DIV/0!"}}]
[null,"\"2\" Находится в стадии формирования (С)",{"$f":"COUNTIF(C7:C34,\"=2\")/дети!G2","v":{"$error":"#DIV/0!"}},{"$f":"COUNTIF(D7:D34,\"=2\")/дети!G2","v":{"$error":"#DIV/0!"}},{"$f":"COUNTIF(E7:E34,\"=2\")/дети!G2","v":{"$error":"#DIV/0!"}},{"$f":"COUNTIF(F7:F34,\"=2\")/дети!G2","v":{"$error":"#DIV/0!"}},{"$f":"COUNTIF(G7:G34,\"=2\")/дети!G2","v":{"$error":"#DIV/0!"}},{"$f":"COUNTIF(H7:H34,\"=2\")/дети!G2","v":{"$error":"#DIV/0!"}},{"$f":"COUNTIF(I7:I34,\"=2\")/дети!G2","v":{"$error":"#DIV/0!"}},{"$f":"COUNTIF(J7:J34,\"=2\")/дети!G2","v":{"$error":"#DIV/0!"}},{"$f":"COUNTIF(K7:K34,\"=2\")/дети!G2","v":{"$error":"#DIV/0!"}},{"$f":"COUNTIF(L7:L34,\"=2\")/дети!G2","v":{"$error":"#DIV/0!"}},{"$f":"COUNTIF(M7:M34,\"=2\")/дети!G2","v":{"$error":"#DIV/0!"}},{"$f":"COUNTIF(N7:N34,\"=2\")/дети!G2","v":{"$error":"#DIV/0!"}},{"$f":"COUNTIF(O7:O34,\"=2\")/дети!G2","v":{"$error":"#DIV/0!"}},{"$f":"COUNTIF(P7:P34,\"=2\")/дети!G2","v":{"$error":"#DIV/0!"}},{"$f":"100%-(Q38+Q36)","v":{"$error":"#DIV/0!"}},{"$f":"100%-(R38+R36)","v":{"$error":"#DIV/0!"}}]
[null,"\"1\" Не сформирован (НС)",{"$f":"COUNTIF(C7:C34,\"=1\")/дети!G2","v":{"$error":"#DIV/0!"}},{"$f":"COUNTIF(D7:D34,\"=1\")/дети!G2","v":{"$error":"#DIV/0!"}},{"$f":"COUNTIF(E7:E34,\"=1\")/дети!G2","v":{"$error":"#DIV/0!"}},{"$f":"COUNTIF(F7:F34,\"=1\")/дети!G2","v":{"$error":"#DIV/0!"}},{"$f":"COUNTIF(G7:G34,\"=1\")/дети!G2","v":{"$error":"#DIV/0!"}},{"$f":"COUNTIF(H7:H34,\"=1\")/дети!G2","v":{"$error":"#DIV/0!"}},{"$f":"COUNTIF(I7:I34,\"=1\")/дети!G2","v":{"$error":"#DIV/0!"}},{"$f":"COUNTIF(J7:J34,\"=1\")/дети!G2","v":{"$error":"#DIV/0!"}},{"$f":"COUNTIF(K7:K34,\"=1\")/дети!G2","v":{"$error":"#DIV/0!"}},{"$f":"COUNTIF(L7:L34,\"=1\")/дети!G2","v":{"$error":"#DIV/0!"}},{"$f":"COUNTIF(M7:M34,\"=1\")/дети!G2","v":{"$error":"#DIV/0!"}},{"$f":"COUNTIF(N7:N34,\"=1\")/дети!G2","v":{"$error":"#DIV/0!"}},{"$f":"COUNTIF(O7:O34,\"=1\")/дети!G2","v":{"$error":"#DIV/0!"}},{"$f":"COUNTIF(P7:P34,\"=1\")/дети!G2","v":{"$error":"#DIV/0!"}},{"$f":"COUNTIF(Q7:Q34,\"<2\")/дети!G2","v":{"$error":"#DIV/0!"}},{"$f":"COUNTIF(R7:R34,\"<2\")/дети!G2","v":{"$error":"#DIV/0!"}}]

{"sheet":"речевое","index":4,"n_rows":38,"n_cols":18,"rows_kept":38,"merged":[[0,0,0,18],[4,2,4,3],[4,4,4,5],[4,6,4,7],[4,8,4,9],[4,10,4,11],[4,12,4,13],[4,14,4,15],[4,16,4,17],[34,0,34,1]]}
[{"$f":"дети!A30","v":"Мониторинг образовательного процесса группы №___ (подготовительная)  на  20___-20___ уч год"}]
[null,{"$f":"дети!A31","v":"Воспитатель: ____________"}]
[null,{"$f":"дети!A32","v":"Воспитатель: ______________"}]
[{"$nulls":3},"Образовательная область «Речевое развитие»  "]
["№ п/п","Фамилия, имя ребенка","Пересказывает и инсценирует небольшие литературные произведения, составляет по плану и образцу рассказы о предмете, по сюжетной картине",null,"Различает звук, слог, слово, предложение, определяет их последовательность",null,"Употребляет синонимы, антонимы, сложные пред-ложения",null,"Знает 2-3 стихотворения, 2-3 считалки, 2-3 загад-ки, называет 2-3 авторов, 2-3 иллюстраторов",null,"Различает жанры литера-турных произведений",null,"Выразительно читает стихотворения, рассказывает сказку",null,"Итоговый показатель по каждому ребенку (ср. значение)",null,"Уровень"]
[null,null,"н.г.","к.г.","н.г.","к.г.","н.г.","к.г.","н.г.","к.г.","н.г.","к.г.","н.г.","к.г.","н.г.","к.г.","н.г.","к.г."]
[1,{"$f":"дети!A1","v":0},{"v":0,"d":"0.0"},{"v":0,"d":"0.0"},{"v":0,"d":"0.0"},{"v":0,"d":"0.0"},{"v":0,"d":"0.0"},{"v":0,"d":"0.0"},{"v":0,"d":"0.0"},{"v":0,"d":"0.0"},{"v":0,"d":"0.0"},{"v":0,"d":"0.0"},{"v":0,"d":"0.0"},{"v":0,"d":"0.0"},{"$f":"(C7+E7+G7+I7+K7+M7)/6","v":{"v":0,"d":"0.0"}},{"$f":"(D7+F7+H7+J7+L7+N7)/6","v":{"v":0,"d":"0.0"}},{"$f":"IF(O7=3,\"B\",IF(O7>=2,\"C\",\"HC\"))","v":"HC"},{"$f":"IF(P7=3,\"B\",IF(P7>=2,\"C\",\"HC\"))","v":"HC"}]
[2,{"$f":"дети!A2","v":0},{"v":0,"d":"0.0"},{"v":0,"d":"0.0"},{"v":0,"d":"0.0"},{"v":0,"d":"0.0"},{"v":0,"d":"0.0"},{"v":0,"d":"0.0"},{"v":0,"d":"0.0"},{"v":0,"d":"0.0"},{"v":0,"d":"0.0"},{"v":0,"d":"0.0"},{"v":0,"d":"0.0"},{"v":0,"d":"0.0"},{"$f":"(C8+E8+G8+I8+K8+M8)/6","v":{"v":0,"d":"0.0"}},{"$f":"(D8+F8+H8+J8+L8+N8)/6","v":{"v":0,"d":"0.0"}},{"$f":"IF(O8=3,\"B\",IF(O8>=2,\"C\",\"HC\"))","v":"HC"},{"$f":"IF(P8=3,\"B\",IF(P8>=2,\"C\",\"HC\"))","v":"HC"}]
[3,{"$f":"дети!A3","v":0},{"v":0,"d":"0.0"},{"v":0,"d":"0.0"},{"v":0,"d":"0.0"},{"v":0,"d":"0.0"},{"v":0,"d":"0.0"},{"v":0,"d":"0.0"},{"v":0,"d":"0.0"},{"v":0,"d":"0.0"},{"v":0,"d":"0.0"},{"v":0,"d":"0.0"},{"v":0,"d":"0.0"},{"v":0,"d":"0.0"},{"v":0,"d":"0.0"},{"v":0,"d":"0.0"},"HC","HC"]
[4,{"$f":"дети!A4","v":0},{"v":0,"d":"0.0"},{"v":0,"d":"0.0"},{"v":0,"d":"0.0"},{"v":0,"d":"0.0"},{"v":0,"d":"0.0"},{"v":0,"d":"0.0"},{"v":0,"d":"0.0"},{"v":0,"d":"0.0"},{"v":0,"d":"0.0"},{"v":0,"d":"0.0"},{"v":0,"d":"0.0"},{"v":0,"d":"0.0"},{"v":0,"d":"0.0"},{"v":0,"d":"0.0"},"HC","HC"]
[5,{"$f":"дети!A5","v":0},{"v":0,"d":"0.0"},{"v":0,"d":"0.0"},{"v":0,"d":"0.0"},{"v":0,"d":"0.0"},{"v":0,"d":"0.0"},{"v":0,"d":"0.0"},{"v":0,"d":"0.0"},{"v":0,"d":"0.0"},{"v":0,"d":"0.0"},{"v":0,"d":"0.0"},{"v":0,"d":"0.0"},{"v":0,"d":"0.0"},{"v":0,"d":"0.0"},{"v":0,"d":"0.0"},"HC","HC"]
[6,{"$f":"дети!A6","v":0},{"v":0,"d":"0.0"},{"v":0,"d":"0.0"},{"v":0,"d":"0.0"},{"v":0,"d":"0.0"},{"v":0,"d":"0.0"},{"v":0,"d":"0.0"},{"v":0,"d":"0.0"},{"v":0,"d":"0.0"},{"v":0,"d":"0.0"},{"v":0,"d":"0.0"},{"v":0,"d":"0.0"},{"v":0,"d":"0.0"},{"v":0,"d":"0.0"},{"v":0,"d":"0.0"},"HC","HC"]
[7,{"$f":"дети!A7","v":0},{"v":0,"d":"0.0"},{"v":0,"d":"0.0"},{"v":0,"d":"0.0"},{"v":0,"d":"0.0"},{"v":0,"d":"0.0"},{"v":0,"d":"0.0"},{"v":0,"d":"0.0"},{"v":0,"d":"0.0"},{"v":0,"d":"0.0"},{"v":0,"d":"0.0"},{"v":0,"d":"0.0"},{"v":0,"d":"0.0"},{"v":0,"d":"0.0"},{"v":0,"d":"0.0"},"HC","HC"]
[8,{"$f":"дети!A8","v":0},{"v":0,"d":"0.0"},{"v":0,"d":"0.0"},{"v":0,"d":"0.0"},{"v":0,"d":"0.0"},{"v":0,"d":"0.0"},{"v":0,"d":"0.0"},{"v":0,"d":"0.0"},{"v":0,"d":"0.0"},{"v":0,"d":"0.0"},{"v":0,"d":"0.0"},{"v":0,"d":"0.0"},{"v":0,"d":"0.0"},{"v":0,"d":"0.0"},{"v":0,"d":"0.0"},"HC","HC"]
[9,{"$f":"дети!A9","v":0},{"v":0,"d":"0.0"},{"v":0,"d":"0.0"},{"v":0,"d":"0.0"},{"v":0,"d":"0.0"},{"v":0,"d":"0.0"},{"v":0,"d":"0.0"},{"v":0,"d":"0.0"},{"v":0,"d":"0.0"},{"v":0,"d":"0.0"},{"v":0,"d":"0.0"},{"v":0,"d":"0.0"},{"v":0,"d":"0.0"},{"v":0,"d":"0.0"},{"v":0,"d":"0.0"},"HC","HC"]
[10,{"$f":"дети!A10","v":0},{"v":0,"d":"0.0"},{"v":0,"d":"0.0"},{"v":0,"d":"0.0"},{"v":0,"d":"0.0"},{"v":0,"d":"0.0"},{"v":0,"d":"0.0"},{"v":0,"d":"0.0"},{"v":0,"d":"0.0"},{"v":0,"d":"0.0"},{"v":0,"d":"0.0"},{"v":0,"d":"0.0"},{"v":0,"d":"0.0"},{"v":0,"d":"0.0"},{"v":0,"d":"0.0"},"HC","HC"]
[11,{"$f":"дети!A11","v":0},{"v":0,"d":"0.0"},{"v":0,"d":"0.0"},{"v":0,"d":"0.0"},{"v":0,"d":"0.0"},{"v":0,"d":"0.0"},{"v":0,"d":"0.0"},{"v":0,"d":"0.0"},{"v":0,"d":"0.0"},{"v":0,"d":"0.0"},{"v":0,"d":"0.0"},{"v":0,"d":"0.0"},{"v":0,"d":"0.0"},{"v":0,"d":"0.0"},{"v":0,"d":"0.0"},"HC","HC"]
[12,{"$f":"дети!A12","v":0},{"v":0,"d":"0.0"},{"v":0,"d":"0.0"},{"v":0,"d":"0.0"},{"v":0,"d":"0.0"},{"v":0,"d":"0.0"},{"v":0,"d":"0.0"},{"v":0,"d":"0.0"},{"v":0,"d":"0.0"},{"v":0,"d":"0.0"},{"v":0,"d":"0.0"},{"v":0,"d":"0.0"},{"v":0,"d":"0.0"},{"v":0,"d":"0.0"},{"v":0,"d":"0.0"},"HC","HC"]
[13,{"$f":"дети!A13","v":0},{"v":0,"d":"0.0"},{"v":0,"d":"0.0"},{"v":0,"d":"0.0"},{"v":0,"d":"0.0"},{"v":0,"d":"0.0"},{"v":0,"d":"0.0"},{"v":0,"d":"0.0"},{"v":0,"d":"0.0"},{"v":0,"d":"0.0"},{"v":0,"d":"0.0"},{"v":0,"d":"0.0"},{"v":0,"d":"0.0"},{"v":0,"d":"0.0"},{"v":0,"d":"0.0"},"HC","HC"]
[14,{"$f":"дети!A14","v":0},{"v":0,"d":"0.0"},{"v":0,"d":"0.0"},{"v":0,"d":"0.0"},{"v":0,"d":"0.0"},{"v":0,"d":"0.0"},{"v":0,"d":"0.0"},{"v":0,"d":"0.0"},{"v":0,"d":"0.0"},{"v":0,"d":"0.0"},{"v":0,"d":"0.0"},{"v":0,"d":"0.0"},{"v":0,"d":"0.0"},{"v":0,"d":"0.0"},{"v":0,"d":"0.0"},"HC","HC"]
[15,{"$f":"дети!A15","v":0},{"v":0,"d":"0.0"},{"v":0,"d":"0.0"},{"v":0,"d":"0.0"},{"v":0,"d":"0.0"},{"v":0,"d":"0.0"},{"v":0,"d":"0.0"},{"v":0,"d":"0.0"},{"v":0,"d":"0.0"},{"v":0,"d":"0.0"},{"v":0,"d":"0.0"},{"v":0,"d":"0.0"},{"v":0,"d":"0.0"},{"v":0,"d":"0.0"},{"v":0,"d":"0.0"},{"$f":"IF(O21=3,\"B\",IF(O21>=2,\"C\",\"HC\"))","v":"HC"},{"$f":"IF(P21=3,\"B\",IF(P21>=2,\"C\",\"HC\"))","v":"HC"}]
[16,{"$f":"дети!A16","v":0},{"v":0,"d":"0.0"},{"v":0,"d":"0.0"},{"v":0,"d":"0.0"},{"v":0,"d":"0.0"},{"v":0,"d":"0.0"},{"v":0,"d":"0.0"},{"v":0,"d":"0.0"},{"v":0,"d":"0.0"},{"v":0,"d":"0.0"},{"v":0,"d":"0.0"},{"v":0,"d":"0.0"},{"v":0,"d":"0.0"},{"v":0,"d":"0.0"},{"v":0,"d":"0.0"},"HC","HC"]
[17,{"$f":"дети!A17","v":0},{"v":0,"d":"0.0"},{"v":0,"d":"0.0"},{"v":0,"d":"0.0"},{"v":0,"d":"0.0"},{"v":0,"d":"0.0"},{"v":0,"d":"0.0"},{"v":0,"d":"0.0"},{"v":0,"d":"0.0"},{"v":0,"d":"0.0"},{"v":0,"d":"0.0"},{"v":0,"d":"0.0"},{"v":0,"d":"0.0"},{"v":0,"d":"0.0"},{"v":0,"d":"0.0"},"HC","HC"]
[18,{"$f":"дети!A18","v":0},{"v":0,"d":"0.0"},{"v":0,"d":"0.0"},{"v":0,"d":"0.0"},{"v":0,"d":"0.0"},{"v":0,"d":"0.0"},{"v":0,"d":"0.0"},{"v":0,"d":"0.0"},{"v":0,"d":"0.0"},{"v":0,"d":"0.0"},{"v":0,"d":"0.0"},{"v":0,"d":"0.0"},{"v":0,"d":"0.0"},{"v":0,"d":"0.0"},{"v":0,"d":"0.0"},"HC","HC"]
[19,{"$f":"дети!A19","v":0},{"v":0,"d":"0.0"},{"v":0,"d":"0.0"},{"v":0,"d":"0.0"},{"v":0,"d":"0.0"},{"v":0,"d":"0.0"},{"v":0,"d":"0.0"},{"v":0,"d":"0.0"},{"v":0,"d":"0.0"},{"v":0,"d":"0.0"},{"v":0,"d":"0.0"},{"v":0,"d":"0.0"},{"v":0,"d":"0.0"},{"v":0,"d":"0.0"},{"v":0,"d":"0.0"},"HC","HC"]
[20,{"$f":"дети!A20","v":0},{"v":0,"d":"0.0"},{"v":0,"d":"0.0"},{"v":0,"d":"0.0"},{"v":0,"d":"0.0"},{"v":0,"d":"0.0"},{"v":0,"d":"0.0"},{"v":0,"d":"0.0"},{"v":0,"d":"0.0"},{"v":0,"d":"0.0"},{"v":0,"d":"0.0"},{"v":0,"d":"0.0"},{"v":0,"d":"0.0"},{"v":0,"d":"0.0"},{"v":0,"d":"0.0"},"HC","HC"]
[21,{"$f":"дети!A21","v":0},{"v":0,"d":"0.0"},{"v":0,"d":"0.0"},{"v":0,"d":"0.0"},{"v":0,"d":"0.0"},{"v":0,"d":"0.0"},{"v":0,"d":"0.0"},{"v":0,"d":"0.0"},{"v":0,"d":"0.0"},{"v":0,"d":"0.0"},{"v":0,"d":"0.0"},{"v":0,"d":"0.0"},{"v":0,"d":"0.0"},{"v":0,"d":"0.0"},{"v":0,"d":"0.0"},"HC","HC"]
[22,{"$f":"дети!A22","v":0},{"v":0,"d":"0.0"},{"v":0,"d":"0.0"},{"v":0,"d":"0.0"},{"v":0,"d":"0.0"},{"v":0,"d":"0.0"},{"v":0,"d":"0.0"},{"v":0,"d":"0.0"},{"v":0,"d":"0.0"},{"v":0,"d":"0.0"},{"v":0,"d":"0.0"},{"v":0,"d":"0.0"},{"v":0,"d":"0.0"},{"v":0,"d":"0.0"},{"v":0,"d":"0.0"},"HC","HC"]
[23,{"$f":"дети!A23","v":0},{"v":0,"d":"0.0"},{"v":0,"d":"0.0"},{"v":0,"d":"0.0"},{"v":0,"d":"0.0"},{"v":0,"d":"0.0"},{"v":0,"d":"0.0"},{"v":0,"d":"0.0"},{"v":0,"d":"0.0"},{"v":0,"d":"0.0"},{"v":0,"d":"0.0"},{"v":0,"d":"0.0"},{"v":0,"d":"0.0"},{"v":0,"d":"0.0"},{"v":0,"d":"0.0"},"HC","HC"]
[24,{"$f":"дети!A24","v":0},{"v":0,"d":"0.0"},{"v":0,"d":"0.0"},{"v":0,"d":"0.0"},{"v":0,"d":"0.0"},{"v":0,"d":"0.0"},{"v":0,"d":"0.0"},{"v":0,"d":"0.0"},{"v":0,"d":"0.0"},{"v":0,"d":"0.0"},{"v":0,"d":"0.0"},{"v":0,"d":"0.0"},{"v":0,"d":"0.0"},{"v":0,"d":"0.0"},{"v":0,"d":"0.0"},"HC","HC"]
[25,{"$f":"дети!A25","v":0},{"v":0,"d":"0.0"},{"v":0,"d":"0.0"},{"v":0,"d":"0.0"},{"v":0,"d":"0.0"},{"v":0,"d":"0.0"},{"v":0,"d":"0.0"},{"v":0,"d":"0.0"},{"v":0,"d":"0.0"},{"v":0,"d":"0.0"},{"v":0,"d":"0.0"},{"v":0,"d":"0.0"},{"v":0,"d":"0.0"},{"v":0,"d":"0.0"},{"v":0,"d":"0.0"},"HC","HC"]
[26,{"$f":"дети!A26","v":0},{"v":0,"d":"0.0"},{"v":0,"d":"0.0"},{"v":0,"d":"0.0"},{"v":0,"d":"0.0"},{"v":0,"d":"0.0"},{"v":0,"d":"0.0"},{"v":0,"d":"0.0"},{"v":0,"d":"0.0"},{"v":0,"d":"0.0"},{"v":0,"d":"0.0"},{"v":0,"d":"0.0"},{"v":0,"d":"0.0"},{"v":0,"d":"0.0"},{"v":0,"d":"0.0"},"HC","HC"]
[27,{"$f":"дети!A27","v":0},{"v":0,"d":"0.0"},{"v":0,"d":"0.0"},{"v":0,"d":"0.0"},{"v":0,"d":"0.0"},{"v":0,"d":"0.0"},{"v":0,"d":"0.0"},{"v":0,"d":"0.0"},{"v":0,"d":"0.0"},{"v":0,"d":"0.0"},{"v":0,"d":"0.0"},{"v":0,"d":"0.0"},{"v":0,"d":"0.0"},{"v":0,"d":"0.0"},{"v":0,"d":"0.0"},"HC","HC"]
[28,{"$f":"дети!A28","v":0},{"v":0,"d":"0.0"},{"v":0,"d":"0.0"},{"v":0,"d":"0.0"},{"v":0,"d":"0.0"},{"v":0,"d":"0.0"},{"v":0,"d":"0.0"},{"v":0,"d":"0.0"},{"v":0,"d":"0.0"},{"v":0,"d":"0.0"},{"v":0,"d":"0.0"},{"v":0,"d":"0.0"},{"v":0,"d":"0.0"},{"v":0,"d":"0.0"},{"v":0,"d":"0.0"},"HC","HC"]
["Итоговый пок-ль по группе (ср. значение)",null,{"$f":"SUM(C7:C34)/23","v":{"v":0,"d":"0.0"}},{"v":0,"d":"0.0"},{"v":0,"d":"0.0"},{"v":0,"d":"0.0"},{"v":0,"d":"0.0"},{"v":0,"d":"0.0"},{"v":0,"d":"0.0"},{"v":0,"d":"0.0"},{"v":0,"d":"0.0"},{"v":0,"d":"0.0"},{"v":0,"d":"0.0"},{"v":0,"d":"0.0"},{"$f":"SUM(O7:O34)/дети!G2","v":{"$error":"#DIV/0!"}},{"$f":"SUM(P7:P34)/дети!G2","v":{"$error":"#DIV/0!"}},{"$f":"SUM(Q7:Q34)/23","v":0},{"$f":"SUM(R7:R34)/23","v":0}]
[null,"\"3\" Сформирован (В)",{"$f":"COUNTIF(C7:C34,\"=3\")/дети!G2","v":{"$error":"#DIV/0!"}},{"$f":"COUNTIF(D7:D34,\"=3\")/дети!G2","v":{"$error":"#DIV/0!"}},{"$f":"COUNTIF(E7:E34,\"=3\")/дети!G2","v":{"$error":"#DIV/0!"}},{"$f":"COUNTIF(F7:F34,\"=3\")/дети!G2","v":{"$error":"#DIV/0!"}},{"$f":"COUNTIF(G7:G34,\"=3\")/дети!G2","v":{"$error":"#DIV/0!"}},{"$f":"COUNTIF(H7:H34,\"=3\")/дети!G2","v":{"$error":"#DIV/0!"}},{"$f":"COUNTIF(I7:I34,\"=3\")/дети!G2","v":{"$error":"#DIV/0!"}},{"$f":"COUNTIF(J7:J34,\"=3\")/дети!G2","v":{"$error":"#DIV/0!"}},{"$f":"COUNTIF(K7:K34,\"=3\")/дети!G2","v":{"$error":"#DIV/0!"}},{"$f":"COUNTIF(L7:L34,\"=3\")/дети!G2","v":{"$error":"#DIV/0!"}},{"$f":"COUNTIF(M7:M34,\"=3\")/дети!G2","v":{"$error":"#DIV/0!"}},{"$f":"COUNTIF(N7:N34,\"=3\")/дети!G2","v":{"$error":"#DIV/0!"}},{"$f":"COUNTIF(O7:O34,\"=3\")/дети!G2","v":{"$error":"#DIV/0!"}},{"$f":"COUNTIF(P7:P34,\"=3\")/дети!G2","v":{"$error":"#DIV/0!"}}]
[null,"\"2\" Находится в стадии формирования (С)",{"$f":"COUNTIF(C7:C34,\"=2\")/дети!G2","v":{"$error":"#DIV/0!"}},{"$f":"COUNTIF(D7:D34,\"=2\")/дети!G2","v":{"$error":"#DIV/0!"}},{"$f":"COUNTIF(E7:E34,\"=2\")/дети!G2","v":{"$error":"#DIV/0!"}},{"$f":"COUNTIF(F7:F34,\"=2\")/дети!G2","v":{"$error":"#DIV/0!"}},{"$f":"COUNTIF(G7:G34,\"=2\")/дети!G2","v":{"$error":"#DIV/0!"}},{"$f":"COUNTIF(H7:H34,\"=2\")/дети!G2","v":{"$error":"#DIV/0!"}},{"$f":"COUNTIF(I7:I34,\"=2\")/дети!G2","v":{"$error":"#DIV/0!"}},{"$f":"COUNTIF(J7:J34,\"=2\")/дети!G2","v":{"$error":"#DIV/0!"}},{"$f":"COUNTIF(K7:K34,\"=2\")/дети!G2","v":{"$error":"#DIV/0!"}},{"$f":"COUNTIF(L7:L34,\"=2\")/дети!G2","v":{"$error":"#DIV/0!"}},{"$f":"COUNTIF(M7:M34,\"=2\")/дети!G2","v":{"$error":"#DIV/0!"}},{"$f":"COUNTIF(N7:N34,\"=2\")/дети!G2","v":{"$error":"#DIV/0!"}},{"$f":"100%-(O38+O36)","v":{"$error":"#DIV/0!"}},{"$f":"100%-(P38+P36)","v":{"$error":"#DIV/0!"}}]
[null,"\"1\" Не сформирован (НС)",{"$f":"COUNTIF(C7:C34,\"=1\")/дети!G2","v":{"$error":"#DIV/0!"}},{"$f":"COUNTIF(D7:D34,\"=1\")/дети!G2","v":{"$error":"#DIV/0!"}},{"$f":"COUNTIF(E7:E34,\"=1\")/дети!G2","v":{"$error":"#DIV/0!"}},{"$f":"COUNTIF(F7:F34,\"=1\")/дети!G2","v":{"$error":"#DIV/0!"}},{"$f":"COUNTIF(G7:G34,\"=1\")/дети!G2","v":{"$error":"#DIV/0!"}},{"$f":"COUNTIF(H7:H34,\"=1\")/дети!G2","v":{"$error":"#DIV/0!"}},{"$f":"COUNTIF(I7:I34,\"=1\")/дети!G2","v":{"$error":"#DIV/0!"}},{"$f":"COUNTIF(J7:J34,\"=1\")/дети!G2","v":{"$error":"#DIV/0!"}},{"$f":"COUNTIF(K7:K34,\"=1\")/дети!G2","v":{"$error":"#DIV/0!"}},{"$f":"COUNTIF(L7:L34,\"=1\")/дети!G2","v":{"$error":"#DIV/0!"}},{"$f":"COUNTIF(M7:M34,\"=1\")/дети!G2","v":{"$error":"#DIV/0!"}},{"$f":"COUNTIF(N7:N34,\"=1\")/дети!G2","v":{"$error":"#DIV/0!"}},{"$f":"COUNTIF(O7:O34,\"<2\")/дети!G2","v":{"$error":"#DIV/0!"}},{"$f":"COUNTIF(P7:P34,\"<2\")/дети!G2","v":{"$error":"#DIV/0!"}}]

{"sheet":"худ-эст","index":5,"n_rows":40,"n_cols":22,"rows_kept":40,"merged":[[4,0,7,0],[4,1,7,1],[4,2,4,5],[4,6,4,9],[4,10,4,13],[4,14,4,17],[4,18,6,19],[4,20,6,21],[5,2,6,3],[5,4,6,5],[5,6,6,7],[5,8,6,9],[5,10,6,11],[5,12,6,13],[5,14,6,15],[5,16,6,17],[36,0,36,1]]}
[{"$nulls":3},{"$f":"дети!A30","v":"Мониторинг образовательного процесса группы №___ (подготовительная)  на  20___-20___ уч год"}]
[null,{"$f":"дети!A31","v":"Воспитатель: ____________"}]
[null,{"$f":"дети!A32","v":"Воспитатель: ______________"}]
[{"$nulls":3},"Образовательная область «Художественно-эстетическое развитие» "]
["№ п/п","Фамилия, имя ребенка","Рисование",{"$nulls":3},"Лепка",{"$nulls":3},"Аппликация",{"$nulls":3},"Продуктивная (конструктивная) деятельность",{"$nulls":3},"Итоговый показа­тель по каждому ребенку (ср.значение)",null,"Уровень"]
[null,null,"Различает живопись, графику, скульптуру, декоративно- прикладное и народное искусство",null,"Создает индивидуальные и коллективные рисунки, сюжетные композиции, используя разные материалы и способы создания изображений",null,"Лепит различные предметы, создает композиции из 2—3 предметов, выполняет деко-ративные компо-зиции налепом и рельефом",null,"Создает различные конструкции одного и того же объекта",null,"Правильно дер-жит ножницы, использует раз-нообразные при¬емы вырезания",null,"Изображает предметы и создает сложные сюжетные композиции из\nнескольких частей. Составляет узоры из растительных форм и геомегрическнх фигур\n",null,"Создает различные конструкции одного и того же объекта",null,"Создает модели из конструктора по рисунку и словесной инструкции"]
[]
[null,null,"н.г.","к.г.","н.г.","к.г.","н.г.","к.г.","н.г.","к.г.","н.г.","к.г.","н.г.","к.г.","н.г.","к.г.","н.г.","к.г.","н.г.","к.г.","н.г.","к.г."]
[1,{"$f":"дети!A1","v":0},{"v":0,"d":"0.0"},{"v":0,"d":"0.0"},{"v":0,"d":"0.0"},{"v":0,"d":"0.0"},{"v":0,"d":"0.0"},{"v":0,"d":"0.0"},{"v":0,"d":"0.0"},{"v":0,"d":"0.0"},{"v":0,"d":"0.0"},{"v":0,"d":"0.0"},{"v":0,"d":"0.0"},{"v":0,"d":"0.0"},{"v":0,"d":"0.0"},{"v":0,"d":"0.0"},{"v":0,"d":"0.0"},{"v":0,"d":"0.0"},{"$f":"(C9+E9+G9+I9+K9+M9+O9+Q9)/8","v":{"v":0,"d":"0.0"}},{"$f":"SUM(D9,F9,H9,J9,L9,N9,P9,R9)/8","v":{"v":0,"d":"0.0"}},{"$f":"IF(S9=3,\"B\",IF(S9>=2,\"C\",\"HC\"))","v":"HC"},{"$f":"IF(T9=3,\"B\",IF(T9>=2,\"C\",\"HC\"))","v":"HC"}]
[2,{"$f":"дети!A2","v":0},{"v":0,"d":"0.0"},{"v":0,"d":"0.0"},{"v":0,"d":"0.0"},{"v":0,"d":"0.0"},{"v":0,"d":"0.0"},{"v":0,"d":"0.0"},{"v":0,"d":"0.0"},{"v":0,"d":"0.0"},{"v":0,"d":"0.0"},{"v":0,"d":"0.0"},{"v":0,"d":"0.0"},{"v":0,"d":"0.0"},{"v":0,"d":"0.0"},{"v":0,"d":"0.0"},{"v":0,"d":"0.0"},{"v":0,"d":"0.0"},{"$f":"(C10+E10+G10+I10+K10+M10+O10+Q10)/8","v":{"v":0,"d":"0.0"}},{"$f":"(D10+F10+H10+J10+L10+N10+P10+R10)/8","v":{"v":0,"d":"0.0"}},{"$f":"IF(S10=3,\"B\",IF(S10>=2,\"C\",\"HC\"))","v":"HC"},{"$f":"IF(T10=3,\"B\",IF(T10>=2,\"C\",\"HC\"))","v":"HC"}]
[3,{"$f":"дети!A3","v":0},{"v":0,"d":"0.0"},{"v":0,"d":"0.0"},{"v":0,"d":"0.0"},{"v":0,"d":"0.0"},{"v":0,"d":"0.0"},{"v":0,"d":"0.0"},{"v":0,"d":"0.0"},{"v":0,"d":"0.0"},{"v":0,"d":"0.0"},{"v":0,"d":"0.0"},{"v":0,"d":"0.0"},{"v":0,"d":"0.0"},{"v":0,"d":"0.0"},{"v":0,"d":"0.0"},{"v":0,"d":"0.0"},{"v":0,"d":"0.0"},{"v":0,"d":"0.0"},{"v":0,"d":"0.0"},"HC","HC"]
[4,{"$f":"дети!A4","v":0},{"v":0,"d":"0.0"},{"v":0,"d":"0.0"},{"v":0,"d":"0.0"},{"v":0,"d":"0.0"},{"v":0,"d":"0.0"},{"v":0,"d":"0.0"},{"v":0,"d":"0.0"},{"v":0,"d":"0.0"},{"v":0,"d":"0.0"},{"v":0,"d":"0.0"},{"v":0,"d":"0.0"},{"v":0,"d":"0.0"},{"v":0,"d":"0.0"},{"v":0,"d":"0.0"},{"v":0,"d":"0.0"},{"v":0,"d":"0.0"},{"v":0,"d":"0.0"},{"v":0,"d":"0.0"},"HC","HC"]
[5,{"$f":"дети!A5","v":0},{"v":0,"d":"0.0"},{"v":0,"d":"0.0"},{"v":0,"d":"0.0"},{"v":0,"d":"0.0"},{"v":0,"d":"0.0"},{"v":0,"d":"0.0"},{"v":0,"d":"0.0"},{"v":0,"d":"0.0"},{"v":0,"d":"0.0"},{"v":0,"d":"0.0"},{"v":0,"d":"0.0"},{"v":0,"d":"0.0"},{"v":0,"d":"0.0"},{"v":0,"d":"0.0"},{"v":0,"d":"0.0"},{"v":0,"d":"0.0"},{"v":0,"d":"0.0"},{"v":0,"d":"0.0"},"HC","HC"]
[6,{"$f":"дети!A6","v":0},{"v":0,"d":"0.0"},{"v":0,"d":"0.0"},{"v":0,"d":"0.0"},{"v":0,"d":"0.0"},{"v":0,"d":"0.0"},{"v":0,"d":"0.0"},{"v":0,"d":"0.0"},{"v":0,"d":"0.0"},{"v":0,"d":"0.0"},{"v":0,"d":"0.0"},{"v":0,"d":"0.0"},{"v":0,"d":"0.0"},{"v":0,"d":"0.0"},{"v":0,"d":"0.0"},{"v":0,"d":"0.0"},{"v":0,"d":"0.0"},{"v":0,"d":"0.0"},{"v":0,"d":"0.0"},"HC","HC"]
[7,{"$f":"дети!A7","v":0},{"v":0,"d":"0.0"},{"v":0,"d":"0.0"},{"v":0,"d":"0.0"},{"v":0,"d":"0.0"},{"v":0,"d":"0.0"},{"v":0,"d":"0.0"},{"v":0,"d":"0.0"},{"v":0,"d":"0.0"},{"v":0,"d":"0.0"},{"v":0,"d":"0.0"},{"v":0,"d":"0.0"},{"v":0,"d":"0.0"},{"v":0,"d":"0.0"},{"v":0,"d":"0.0"},{"v":0,"d":"0.0"},{"v":0,"d":"0.0"},{"v":0,"d":"0.0"},{"v":0,"d":"0.0"},"HC","HC"]
[8,{"$f":"дети!A8","v":0},{"v":0,"d":"0.0"},{"v":0,"d":"0.0"},{"v":0,"d":"0.0"},{"v":0,"d":"0.0"},{"v":0,"d":"0.0"},{"v":0,"d":"0.0"},{"v":0,"d":"0.0"},{"v":0,"d":"0.0"},{"v":0,"d":"0.0"},{"v":0,"d":"0.0"},{"v":0,"d":"0.0"},{"v":0,"d":"0.0"},{"v":0,"d":"0.0"},{"v":0,"d":"0.0"},{"v":0,"d":"0.0"},{"v":0,"d":"0.0"},{"v":0,"d":"0.0"},{"v":0,"d":"0.0"},"HC","HC"]
[9,{"$f":"дети!A9","v":0},{"v":0,"d":"0.0"},{"v":0,"d":"0.0"},{"v":0,"d":"0.0"},{"v":0,"d":"0.0"},{"v":0,"d":"0.0"},{"v":0,"d":"0.0"},{"v":0,"d":"0.0"},{"v":0,"d":"0.0"},{"v":0,"d":"0.0"},{"v":0,"d":"0.0"},{"v":0,"d":"0.0"},{"v":0,"d":"0.0"},{"v":0,"d":"0.0"},{"v":0,"d":"0.0"},{"v":0,"d":"0.0"},{"v":0,"d":"0.0"},{"v":0,"d":"0.0"},{"v":0,"d":"0.0"},"HC","HC"]
[10,{"$f":"дети!A10","v":0},{"v":0,"d":"0.0"},{"v":0,"d":"0.0"},{"v":0,"d":"0.0"},{"v":0,"d":"0.0"},{"v":0,"d":"0.0"},{"v":0,"d":"0.0"},{"v":0,"d":"0.0"},{"v":0,"d":"0.0"},{"v":0,"d":"0.0"},{"v":0,"d":"0.0"},{"v":0,"d":"0.0"},{"v":0,"d":"0.0"},{"v":0,"d":"0.0"},{"v":0,"d":"0.0"},{"v":0,"d":"0.0"},{"v":0,"d":"0.0"},{"v":0,"d":"0.0"},{"v":0,"d":"0.0"},"HC","HC"]
[11,{"$f":"дети!A11","v":0},{"v":0,"d":"0.0"},{"v":0,"d":"0.0"},{"v":0,"d":"0.0"},{"v":0,"d":"0.0"},{"v":0,"d":"0.0"},{"v":0,"d":"0.0"},{"v":0,"d":"0.0"},{"v":0,"d":"0.0"},{"v":0,"d":"0.0"},{"v":0,"d":"0.0"},{"v":0,"d":"0.0"},{"v":0,"d":"0.0"},{"v":0,"d":"0.0"},{"v":0,"d":"0.0"},{"v":0,"d":"0.0"},{"v":0,"d":"0.0"},{"v":0,"d":"0.0"},{"v":0,"d":"0.0"},"HC","HC"]
[12,{"$f":"дети!A12","v":0},{"v":0,"d":"0.0"},{"v":0,"d":"0.0"},{"v":0,"d":"0.0"},{"v":0,"d":"0.0"},{"v":0,"d":"0.0"},{"v":0,"d":"0.0"},{"v":0,"d":"0.0"},{"v":0,"d":"0.0"},{"v":0,"d":"0.0"},{"v":0,"d":"0.0"},{"v":0,"d":"0.0"},{"v":0,"d":"0.0"},{"v":0,"d":"0.0"},{"v":0,"d":"0.0"},{"v":0,"d":"0.0"},{"v":0,"d":"0.0"},{"v":0,"d":"0.0"},{"v":0,"d":"0.0"},"HC","HC"]
[13,{"$f":"дети!A13","v":0},{"v":0,"d":"0.0"},{"v":0,"d":"0.0"},{"v":0,"d":"0.0"},{"v":0,"d":"0.0"},{"v":0,"d":"0.0"},{"v":0,"d":"0.0"},{"v":0,"d":"0.0"},{"v":0,"d":"0.0"},{"v":0,"d":"0.0"},{"v":0,"d":"0.0"},{"v":0,"d":"0.0"},{"v":0,"d":"0.0"},{"v":0,"d":"0.0"},{"v":0,"d":"0.0"},{"v":0,"d":"0.0"},{"v":0,"d":"0.0"},{"v":0,"d":"0.0"},{"v":0,"d":"0.0"},"HC","HC"]
[14,{"$f":"дети!A14","v":0},{"v":0,"d":"0.0"},{"v":0,"d":"0.0"},{"v":0,"d":"0.0"},{"v":0,"d":"0.0"},{"v":0,"d":"0.0"},{"v":0,"d":"0.0"},{"v":0,"d":"0.0"},{"v":0,"d":"0.0"},{"v":0,"d":"0.0"},{"v":0,"d":"0.0"},{"v":0,"d":"0.0"},{"v":0,"d":"0.0"},{"v":0,"d":"0.0"},{"v":0,"d":"0.0"},{"v":0,"d":"0.0"},{"v":0,"d":"0.0"},{"v":0,"d":"0.0"},{"v":0,"d":"0.0"},"HC","HC"]
[15,{"$f":"дети!A15","v":0},{"v":0,"d":"0.0"},{"v":0,"d":"0.0"},{"v":0,"d":"0.0"},{"v":0,"d":"0.0"},{"v":0,"d":"0.0"},{"v":0,"d":"0.0"},{"v":0,"d":"0.0"},{"v":0,"d":"0.0"},{"v":0,"d":"0.0"},{"v":0,"d":"0.0"},{"v":0,"d":"0.0"},{"v":0,"d":"0.0"},{"v":0,"d":"0.0"},{"v":0,"d":"0.0"},{"v":0,"d":"0.0"},{"v":0,"d":"0.0"},{"$f":"(C23+E23+G23+I23+K23+M23+O23+Q23)/8","v":{"v":0,"d":"0.0"}},{"$f":"(D23+F23+H23+J23+L23+N23+P23+R23)/8","v":{"v":0,"d":"0.0"}},{"$f":"IF(S23=3,\"B\",IF(S23>=2,\"C\",\"HC\"))","v":"HC"},{"$f":"IF(T23=3,\"B\",IF(T23>=2,\"C\",\"HC\"))","v":"HC"}]
[16,{"$f":"дети!A16","v":0},{"v":0,"d":"0.0"},{"v":0,"d":"0.0"},{"v":0,"d":"0.0"},{"v":0,"d":"0.0"},{"v":0,"d":"0.0"},{"v":0,"d":"0.0"},{"v":0,"d":"0.0"},{"v":0,"d":"0.0"},{"v":0,"d":"0.0"},{"v":0,"d":"0.0"},{"v":0,"d":"0.0"},{"v":0,"d":"0.0"},{"v":0,"d":"0.0"},{"v":0,"d":"0.0"},{"v":0,"d":"0.0"},{"v":0,"d":"0.0"},{"v":0,"d":"0.0"},{"v":0,"d":"0.0"},"HC","HC"]
[17,{"$f":"дети!A17","v":0},{"v":0,"d":"0.0"},{"v":0,"d":"0.0"},{"v":0,"d":"0.0"},{"v":0,"d":"0.0"},{"v":0,"d":"0.0"},{"v":0,"d":"0.0"},{"v":0,"d":"0.0"},{"v":0,"d":"0.0"},{"v":0,"d":"0.0"},{"v":0,"d":"0.0"},{"v":0,"d":"0.0"},{"v":0,"d":"0.0"},{"v":0,"d":"0.0"},{"v":0,"d":"0.0"},{"v":0,"d":"0.0"},{"v":0,"d":"0.0"},{"v":0,"d":"0.0"},{"v":0,"d":"0.0"},"HC","HC"]
[18,{"$f":"дети!A18","v":0},{"v":0,"d":"0.0"},{"v":0,"d":"0.0"},{"v":0,"d":"0.0"},{"v":0,"d":"0.0"},{"v":0,"d":"0.0"},{"v":0,"d":"0.0"},{"v":0,"d":"0.0"},{"v":0,"d":"0.0"},{"v":0,"d":"0.0"},{"v":0,"d":"0.0"},{"v":0,"d":"0.0"},{"v":0,"d":"0.0"},{"v":0,"d":"0.0"},{"v":0,"d":"0.0"},{"v":0,"d":"0.0"},{"v":0,"d":"0.0"},{"v":0,"d":"0.0"},{"v":0,"d":"0.0"},"HC","HC"]
[19,{"$f":"дети!A19","v":0},{"v":0,"d":"0.0"},{"v":0,"d":"0.0"},{"v":0,"d":"0.0"},{"v":0,"d":"0.0"},{"v":0,"d":"0.0"},{"v":0,"d":"0.0"},{"v":0,"d":"0.0"},{"v":0,"d":"0.0"},{"v":0,"d":"0.0"},{"v":0,"d":"0.0"},{"v":0,"d":"0.0"},{"v":0,"d":"0.0"},{"v":0,"d":"0.0"},{"v":0,"d":"0.0"},{"v":0,"d":"0.0"},{"v":0,"d":"0.0"},{"v":0,"d":"0.0"},{"v":0,"d":"0.0"},"HC","HC"]
[20,{"$f":"дети!A20","v":0},{"v":0,"d":"0.0"},{"v":0,"d":"0.0"},{"v":0,"d":"0.0"},{"v":0,"d":"0.0"},{"v":0,"d":"0.0"},{"v":0,"d":"0.0"},{"v":0,"d":"0.0"},{"v":0,"d":"0.0"},{"v":0,"d":"0.0"},{"v":0,"d":"0.0"},{"v":0,"d":"0.0"},{"v":0,"d":"0.0"},{"v":0,"d":"0.0"},{"v":0,"d":"0.0"},{"v":0,"d":"0.0"},{"v":0,"d":"0.0"},{"v":0,"d":"0.0"},{"v":0,"d":"0.0"},"HC","HC"]
[21,{"$f":"дети!A21","v":0},{"v":0,"d":"0.0"},{"v":0,"d":"0.0"},{"v":0,"d":"0.0"},{"v":0,"d":"0.0"},{"v":0,"d":"0.0"},{"v":0,"d":"0.0"},{"v":0,"d":"0.0"},{"v":0,"d":"0.0"},{"v":0,"d":"0.0"},{"v":0,"d":"0.0"},{"v":0,"d":"0.0"},{"v":0,"d":"0.0"},{"v":0,"d":"0.0"},{"v":0,"d":"0.0"},{"v":0,"d":"0.0"},{"v":0,"d":"0.0"},{"v":0,"d":"0.0"},{"v":0,"d":"0.0"},"HC","HC"]
[22,{"$f":"дети!A22","v":0},{"v":0,"d":"0.0"},{"v":0,"d":"0.0"},{"v":0,"d":"0.0"},{"v":0,"d":"0.0"},{"v":0,"d":"0.0"},{"v":0,"d":"0.0"},{"v":0,"d":"0.0"},{"v":0,"d":"0.0"},{"v":0,"d":"0.0"},{"v":0,"d":"0.0"},{"v":0,"d":"0.0"},{"v":0,"d":"0.0"},{"v":0,"d":"0.0"},{"v":0,"d":"0.0"},{"v":0,"d":"0.0"},{"v":0,"d":"0.0"},{"v":0,"d":"0.0"},{"v":0,"d":"0.0"},"HC","HC"]
[23,{"$f":"дети!A23","v":0},{"v":0,"d":"0.0"},{"v":0,"d":"0.0"},{"v":0,"d":"0.0"},{"v":0,"d":"0.0"},{"v":0,"d":"0.0"},{"v":0,"d":"0.0"},{"v":0,"d":"0.0"},{"v":0,"d":"0.0"},{"v":0,"d":"0.0"},{"v":0,"d":"0.0"},{"v":0,"d":"0.0"},{"v":0,"d":"0.0"},{"v":0,"d":"0.0"},{"v":0,"d":"0.0"},{"v":0,"d":"0.0"},{"v":0,"d":"0.0"},{"v":0,"d":"0.0"},{"v":0,"d":"0.0"},"HC","HC"]
[24,{"$f":"дети!A24","v":0},{"v":0,"d":"0.0"},{"v":0,"d":"0.0"},{"v":0,"d":"0.0"},{"v":0,"d":"0.0"},{"v":0,"d":"0.0"},{"v":0,"d":"0.0"},{"v":0,"d":"0.0"},{"v":0,"d":"0.0"},{"v":0,"d":"0.0"},{"v":0,"d":"0.0"},{"v":0,"d":"0.0"},{"v":0,"d":"0.0"},{"v":0,"d":"0.0"},{"v":0,"d":"0.0"},{"v":0,"d":"0.0"},{"v":0,"d":"0.0"},{"v":0,"d":"0.0"},{"v":0,"d":"0.0"},"HC","HC"]
[25,{"$f":"дети!A25","v":0},{"v":0,"d":"0.0"},{"v":0,"d":"0.0"},{"v":0,"d":"0.0"},{"v":0,"d":"0.0"},{"v":0,"d":"0.0"},{"v":0,"d":"0.0"},{"v":0,"d":"0.0"},{"v":0,"d":"0.0"},{"v":0,"d":"0.0"},{"v":0,"d":"0.0"},{"v":0,"d":"0.0"},{"v":0,"d":"0.0"},{"v":0,"d":"0.0"},{"v":0,"d":"0.0"},{"v":0,"d":"0.0"},{"v":0,"d":"0.0"},{"v":0,"d":"0.0"},{"v":0,"d":"0.0"},"HC","HC"]
[26,{"$f":"дети!A26","v":0},{"v":0,"d":"0.0"},{"v":0,"d":"0.0"},{"v":0,"d":"0.0"},{"v":0,"d":"0.0"},{"v":0,"d":"0.0"},{"v":0,"d":"0.0"},{"v":0,"d":"0.0"},{"v":0,"d":"0.0"},{"v":0,"d":"0.0"},{"v":0,"d":"0.0"},{"v":0,"d":"0.0"},{"v":0,"d":"0.0"},{"v":0,"d":"0.0"},{"v":0,"d":"0.0"},{"v":0,"d":"0.0"},{"v":0,"d":"0.0"},{"v":0,"d":"0.0"},{"v":0,"d":"0.0"},"HC","HC"]
[27,{"$f":"дети!A27","v":0},{"v":0,"d":"0.0"},{"v":0,"d":"0.0"},{"v":0,"d":"0.0"},{"v":0,"d":"0.0"},{"v":0,"d":"0.0"},{"v":0,"d":"0.0"},{"v":0,"d":"0.0"},{"v":0,"d":"0.0"},{"v":0,"d":"0.0"},{"v":0,"d":"0.0"},{"v":0,"d":"0.0"},{"v":0,"d":"0.0"},{"v":0,"d":"0.0"},{"v":0,"d":"0.0"},{"v":0,"d":"0.0"},{"v":0,"d":"0.0"},{"v":0,"d":"0.0"},{"v":0,"d":"0.0"},"HC","HC"]
[28,{"$f":"дети!A28","v":0},{"v":0,"d":"0.0"},{"v":0,"d":"0.0"},{"v":0,"d":"0.0"},{"v":0,"d":"0.0"},{"v":0,"d":"0.0"},{"v":0,"d":"0.0"},{"v":0,"d":"0.0"},{"v":0,"d":"0.0"},{"v":0,"d":"0.0"},{"v":0,"d":"0.0"},{"v":0,"d":"0.0"},{"v":0,"d":"0.0"},{"v":0,"d":"0.0"},{"v":0,"d":"0.0"},{"v":0,"d":"0.0"},{"v":0,"d":"0.0"},{"v":0,"d":"0.0"},{"v":0,"d":"0.0"},"HC","HC"]
["Итоговый пок-ль по группе (ср. значение)",null,{"$f":"SUM(C9:C36)/дети!G2","v":{"$error":"#DIV/0!"}},{"$f":"SUM(D9:D36)/23","v":{"v":0,"d":"0.0"}},{"v":0,"d":"0.0"},{"v":0,"d":"0.0"},{"v":0,"d":"0.0"},{"v":0,"d":"0.0"},{"v":0,"d":"0.0"},{"v":0,"d":"0.0"},{"v":0,"d":"0.0"},{"v":0,"d":"0.0"},{"v":0,"d":"0.0"},{"v":0,"d":"0.0"},{"v":0,"d":"0.0"},{"v":0,"d":"0.0"},{"v":0,"d":"0.0"},{"v":0,"d":"0.0"},{"$f":"SUM(S9:S36)/дети!G2","v":{"$error":"#DIV/0!"}},{"$f":"SUM(T9:T36)/дети!G2","v":{"$error":"#DIV/0!"}},{"$f":"SUM(U9:U36)/23","v":0},{"$f":"SUM(V9:V36)/23","v":0}]
[null,"\"3\" Сформирован (В)",{"$f":"COUNTIF(C9:C36,\"=3\")/дети!G2","v":{"$error":"#DIV/0!"}},{"$f":"COUNTIF(D9:D36,\"=3\")/дети!G2","v":{"$error":"#DIV/0!"}},{"$f":"COUNTIF(E9:E36,\"=3\")/дети!G2","v":{"$error":"#DIV/0!"}},{"$f":"COUNTIF(F9:F36,\"=3\")/дети!G2","v":{"$error":"#DIV/0!"}},{"$f":"COUNTIF(G9:G36,\"=3\")/дети!G2","v":{"$error":"#DIV/0!"}},{"$f":"COUNTIF(H9:H36,\"=3\")/дети!G2","v":{"$error":"#DIV/0!"}},{"$f":"COUNTIF(I9:I36,\"=3\")/дети!G2","v":{"$error":"#DIV/0!"}},{"$f":"COUNTIF(J9:J36,\"=3\")/дети!G2","v":{"$error":"#DIV/0!"}},{"$f":"COUNTIF(K9:K36,\"=3\")/дети!G2","v":{"$error":"#DIV/0!"}},{"$f":"COUNTIF(L9:L36,\"=3\")/дети!G2","v":{"$error":"#DIV/0!"}},{"$f":"COUNTIF(M9:M36,\"=3\")/дети!G2","v":{"$error":"#DIV/0!"}},{"$f":"COUNTIF(N9:N36,\"=3\")/дети!G2","v":{"$error":"#DIV/0!"}},{"$f":"COUNTIF(O9:O36,\"=3\")/дети!G2","v":{"$error":"#DIV/0!"}},{"$f":"COUNTIF(P9:P36,\"=3\")/дети!G2","v":{"$error":"#DIV/0!"}},{"$f":"COUNTIF(Q9:Q36,\"=3\")/дети!G2","v":{"$error":"#DIV/0!"}},{"$f":"COUNTIF(R9:R36,\"=3\")/дети!G2","v":{"$error":"#DIV/0!"}},{"$f":"COUNTIF(S9:S36,\"=3\")/дети!G2","v":{"$error":"#DIV/0!"}},{"$f":"COUNTIF(T9:T36,\"=3\")/дети!G2","v":{"$error":"#DIV/0!"}}]
[null,"\"2\" Находится в стадии формирования (С)",{"$f":"COUNTIF(C9:C36,\"=2\")/дети!G2","v":{"$error":"#DIV/0!"}},{"$f":"COUNTIF(D9:D36,\"=2\")/дети!G2","v":{"$error":"#DIV/0!"}},{"$f":"COUNTIF(E9:E36,\"=2\")/дети!G2","v":{"$error":"#DIV/0!"}},{"$f":"COUNTIF(F9:F36,\"=2\")/дети!G2","v":{"$error":"#DIV/0!"}},{"$f":"COUNTIF(G9:G36,\"=2\")/дети!G2","v":{"$error":"#DIV/0!"}},{"$f":"COUNTIF(H9:H36,\"=2\")/дети!G2","v":{"$error":"#DIV/0!"}},{"$f":"COUNTIF(I9:I36,\"=2\")/дети!G2","v":{"$error":"#DIV/0!"}},{"$f":"COUNTIF(J9:J36,\"=2\")/дети!G2","v":{"$error":"#DIV/0!"}},{"$f":"COUNTIF(K9:K36,\"=2\")/дети!G2","v":{"$error":"#DIV/0!"}},{"$f":"COUNTIF(L9:L36,\"=2\")/дети!G2","v":{"$error":"#DIV/0!"}},{"$f":"COUNTIF(M9:M36,\"=2\")/дети!G2","v":{"$error":"#DIV/0!"}},{"$f":"COUNTIF(N9:N36,\"=2\")/дети!G2","v":{"$error":"#DIV/0!"}},{"$f":"COUNTIF(O9:O36,\"=2\")/дети!G2","v":{"$error":"#DIV/0!"}},{"$f":"COUNTIF(P9:P36,\"=2\")/дети!G2","v":{"$error":"#DIV/0!"}},{"$f":"COUNTIF(Q9:Q36,\"=2\")/дети!G2","v":{"$error":"#DIV/0!"}},{"$f":"COUNTIF(R9:R36,\"=2\")/дети!G2","v":{"$error":"#DIV/0!"}},{"$f":"100%-(S40+S38)","v":{"$error":"#DIV/0!"}},{"$f":"100%-(T40+T38)","v":{"$error":"#DIV/0!"}}]
[null,"\"1\" Не сформирован (НС)",{"$f":"COUNTIF(C9:C36,\"=1\")/дети!G2","v":{"$error":"#DIV/0!"}},{"$f":"COUNTIF(D9:D36,\"=1\")/дети!G2","v":{"$error":"#DIV/0!"}},{"$f":"COUNTIF(E9:E36,\"=1\")/дети!G2","v":{"$error":"#DIV/0!"}},{"$f":"COUNTIF(F9:F36,\"=1\")/дети!G2","v":{"$error":"#DIV/0!"}},{"$f":"COUNTIF(G9:G36,\"=1\")/дети!G2","v":{"$error":"#DIV/0!"}},{"$f":"COUNTIF(H9:H36,\"=1\")/дети!G2","v":{"$error":"#DIV/0!"}},{"$f":"COUNTIF(I9:I36,\"=1\")/дети!G2","v":{"$error":"#DIV/0!"}},{"$f":"COUNTIF(J9:J36,\"=1\")/дети!G2","v":{"$error":"#DIV/0!"}},{"$f":"COUNTIF(K9:K36,\"=1\")/дети!G2","v":{"$error":"#DIV/0!"}},{"$f":"COUNTIF(L9:L36,\"=1\")/дети!G2","v":{"$error":"#DIV/0!"}},{"$f":"COUNTIF(M9:M36,\"=1\")/дети!G2","v":{"$error":"#DIV/0!"}},{"$f":"COUNTIF(N9:N36,\"=1\")/дети!G2","v":{"$error":"#DIV/0!"}},{"$f":"COUNTIF(O9:O36,\"=1\")/дети!G2","v":{"$error":"#DIV/0!"}},{"$f":"COUNTIF(P9:P36,\"=1\")/дети!G2","v":{"$error":"#DIV/0!"}},{"$f":"COUNTIF(Q9:Q36,\"=1\")/дети!G2","v":{"$error":"#DIV/0!"}},{"$f":"COUNTIF(R9:R36,\"=1\")/дети!G2","v":{"$error":"#DIV/0!"}},{"$f":"COUNTIF(S9:S36,\"<2\")/дети!G2","v":{"$error":"#DIV/0!"}},{"$f":"COUNTIF(T9:T36,\"<2\")/дети!G2","v":{"$error":"#DIV/0!"}}]

{"sheet":"музыка","index":6,"n_rows":41,"n_cols":14,"rows_kept":41,"merged":[[4,0,7,0],[4,1,7,1],[4,2,6,3],[4,4,6,5],[4,6,6,7],[4,8,6,9],[4,10,6,11],[4,12,6,13],[36,0,36,1]]}
[null,{"$f":"дети!A30","v":"Мониторинг образовательного процесса группы №___ (подготовительная)  на  20___-20___ уч год"}]
[{"$f":"дети!A31","v":"Воспитатель: ____________"}]
[{"$f":"дети!A32","v":"Воспитатель: ______________"}]
[null,"«Музыкальная деятельность» "]
["№ п/п","Фамилия, имя ребенка","Различает жанры музыкальных произведений, может петь в сопровождении музыкального инструмента, индивидуально и коллективно",null,"Может ритмично дви-гаться в соответствии с характером музыки, самостоятельно инсце-нирует песни, хороводы",null,"Умеет выразительно и ритмично двигаться в соответствии с характером музыки",null,"Исполняет сольно и в ансамбле на детских музыкальных инструментах несложные песни и мелодии",null,"Итоговый показатель по каждому ребенку",null,"Уровень"]
[]
[]
[null,null,"н.г.","к.г.","н.г.","к.г.","н.г.","к.г.","н.г.","к.г.","н.г.","к.г.","н.г.","к.г."]
[1,{"$f":"дети!A1","v":0},{"v":0,"d":"0.0"},{"v":0,"d":"0.0"},{"v":0,"d":"0.0"},{"v":0,"d":"0.0"},{"v":0,"d":"0.0"},{"v":0,"d":"0.0"},{"v":0,"d":"0.0"},{"v":0,"d":"0.0"},{"$f":"(C9+E9+G9+I9)/4","v":{"v":0,"d":"0.0"}},{"$f":"(D9+F9+H9+J9)/4","v":{"v":0,"d":"0.0"}},{"$f":"IF(K9=3,\"B\",IF(K9>=2,\"C\",\"HC\"))","v":"HC"},{"$f":"IF(L9=3,\"B\",IF(L9>=2,\"C\",\"HC\"))","v":"HC"}]
[2,{"$f":"дети!A2","v":0},{"v":0,"d":"0.0"},{"v":0,"d":"0.0"},{"v":0,"d":"0.0"},{"v":0,"d":"0.0"},{"v":0,"d":"0.0"},{"v":0,"d":"0.0"},{"v":0,"d":"0.0"},{"v":0,"d":"0.0"},{"$f":"(C10+E10+G10+I10)/4","v":{"v":0,"d":"0.0"}},{"$f":"(D10+F10+H10+J10)/4","v":{"v":0,"d":"0.0"}},{"$f":"IF(K10=3,\"B\",IF(K10>=2,\"C\",\"HC\"))","v":"HC"},{"$f":"IF(L10=3,\"B\",IF(L10>=2,\"C\",\"HC\"))","v":"HC"}]
[3,{"$f":"дети!A3","v":0},{"v":0,"d":"0.0"},{"v":0,"d":"0.0"},{"v":0,"d":"0.0"},{"v":0,"d":"0.0"},{"v":0,"d":"0.0"},{"v":0,"d":"0.0"},{"v":0,"d":"0.0"},{"v":0,"d":"0.0"},{"v":0,"d":"0.0"},{"v":0,"d":"0.0"},"HC","HC"]
[4,{"$f":"дети!A4","v":0},{"v":0,"d":"0.0"},{"v":0,"d":"0.0"},{"v":0,"d":"0.0"},{"v":0,"d":"0.0"},{"v":0,"d":"0.0"},{"v":0,"d":"0.0"},{"v":0,"d":"0.0"},{"v":0,"d":"0.0"},{"v":0,"d":"0.0"},{"v":0,"d":"0.0"},"HC","HC"]
[5,{"$f":"дети!A5","v":0},{"v":0,"d":"0.0"},{"v":0,"d":"0.0"},{"v":0,"d":"0.0"},{"v":0,"d":"0.0"},{"v":0,"d":"0.0"},{"v":0,"d":"0.0"},{"v":0,"d":"0.0"},{"v":0,"d":"0.0"},{"v":0,"d":"0.0"},{"v":0,"d":"0.0"},"HC","HC"]
[6,{"$f":"дети!A6","v":0},{"v":0,"d":"0.0"},{"v":0,"d":"0.0"},{"v":0,"d":"0.0"},{"v":0,"d":"0.0"},{"v":0,"d":"0.0"},{"v":0,"d":"0.0"},{"v":0,"d":"0.0"},{"v":0,"d":"0.0"},{"v":0,"d":"0.0"},{"v":0,"d":"0.0"},"HC","HC"]
[7,{"$f":"дети!A7","v":0},{"v":0,"d":"0.0"},{"v":0,"d":"0.0"},{"v":0,"d":"0.0"},{"v":0,"d":"0.0"},{"v":0,"d":"0.0"},{"v":0,"d":"0.0"},{"v":0,"d":"0.0"},{"v":0,"d":"0.0"},{"v":0,"d":"0.0"},{"v":0,"d":"0.0"},"HC","HC"]
[8,{"$f":"дети!A8","v":0},{"v":0,"d":"0.0"},{"v":0,"d":"0.0"},{"v":0,"d":"0.0"},{"v":0,"d":"0.0"},{"v":0,"d":"0.0"},{"v":0,"d":"0.0"},{"v":0,"d":"0.0"},{"v":0,"d":"0.0"},{"v":0,"d":"0.0"},{"v":0,"d":"0.0"},"HC","HC"]
[9,{"$f":"дети!A9","v":0},{"v":0,"d":"0.0"},{"v":0,"d":"0.0"},{"v":0,"d":"0.0"},{"v":0,"d":"0.0"},{"v":0,"d":"0.0"},{"v":0,"d":"0.0"},{"v":0,"d":"0.0"},{"v":0,"d":"0.0"},{"v":0,"d":"0.0"},{"v":0,"d":"0.0"},"HC","HC"]
[10,{"$f":"дети!A10","v":0},{"v":0,"d":"0.0"},{"v":0,"d":"0.0"},{"v":0,"d":"0.0"},{"v":0,"d":"0.0"},{"v":0,"d":"0.0"},{"v":0,"d":"0.0"},{"v":0,"d":"0.0"},{"v":0,"d":"0.0"},{"v":0,"d":"0.0"},{"v":0,"d":"0.0"},"HC","HC"]
[11,{"$f":"дети!A11","v":0},{"v":0,"d":"0.0"},{"v":0,"d":"0.0"},{"v":0,"d":"0.0"},{"v":0,"d":"0.0"},{"v":0,"d":"0.0"},{"v":0,"d":"0.0"},{"v":0,"d":"0.0"},{"v":0,"d":"0.0"},{"v":0,"d":"0.0"},{"v":0,"d":"0.0"},"HC","HC"]
[12,{"$f":"дети!A12","v":0},{"v":0,"d":"0.0"},{"v":0,"d":"0.0"},{"v":0,"d":"0.0"},{"v":0,"d":"0.0"},{"v":0,"d":"0.0"},{"v":0,"d":"0.0"},{"v":0,"d":"0.0"},{"v":0,"d":"0.0"},{"v":0,"d":"0.0"},{"v":0,"d":"0.0"},"HC","HC"]
[13,{"$f":"дети!A13","v":0},{"v":0,"d":"0.0"},{"v":0,"d":"0.0"},{"v":0,"d":"0.0"},{"v":0,"d":"0.0"},{"v":0,"d":"0.0"},{"v":0,"d":"0.0"},{"v":0,"d":"0.0"},{"v":0,"d":"0.0"},{"v":0,"d":"0.0"},{"v":0,"d":"0.0"},"HC","HC"]
[14,{"$f":"дети!A14","v":0},{"v":0,"d":"0.0"},{"v":0,"d":"0.0"},{"v":0,"d":"0.0"},{"v":0,"d":"0.0"},{"v":0,"d":"0.0"},{"v":0,"d":"0.0"},{"v":0,"d":"0.0"},{"v":0,"d":"0.0"},{"v":0,"d":"0.0"},{"v":0,"d":"0.0"},"HC","HC"]
[15,{"$f":"дети!A15","v":0},{"v":0,"d":"0.0"},{"v":0,"d":"0.0"},{"v":0,"d":"0.0"},{"v":0,"d":"0.0"},{"v":0,"d":"0.0"},{"v":0,"d":"0.0"},{"v":0,"d":"0.0"},{"v":0,"d":"0.0"},{"v":0,"d":"0.0"},{"v":0,"d":"0.0"},"HC","HC"]
[16,{"$f":"дети!A16","v":0},{"v":0,"d":"0.0"},{"v":0,"d":"0.0"},{"v":0,"d":"0.0"},{"v":0,"d":"0.0"},{"v":0,"d":"0.0"},{"v":0,"d":"0.0"},{"v":0,"d":"0.0"},{"v":0,"d":"0.0"},{"v":0,"d":"0.0"},{"v":0,"d":"0.0"},"HC","HC"]
[17,{"$f":"дети!A17","v":0},{"v":0,"d":"0.0"},{"v":0,"d":"0.0"},{"v":0,"d":"0.0"},{"v":0,"d":"0.0"},{"v":0,"d":"0.0"},{"v":0,"d":"0.0"},{"v":0,"d":"0.0"},{"v":0,"d":"0.0"},{"v":0,"d":"0.0"},{"v":0,"d":"0.0"},"HC","HC"]
[18,{"$f":"дети!A18","v":0},{"v":0,"d":"0.0"},{"v":0,"d":"0.0"},{"v":0,"d":"0.0"},{"v":0,"d":"0.0"},{"v":0,"d":"0.0"},{"v":0,"d":"0.0"},{"v":0,"d":"0.0"},{"v":0,"d":"0.0"},{"v":0,"d":"0.0"},{"v":0,"d":"0.0"},"HC","HC"]
[19,{"$f":"дети!A19","v":0},{"v":0,"d":"0.0"},{"v":0,"d":"0.0"},{"v":0,"d":"0.0"},{"v":0,"d":"0.0"},{"v":0,"d":"0.0"},{"v":0,"d":"0.0"},{"v":0,"d":"0.0"},{"v":0,"d":"0.0"},{"v":0,"d":"0.0"},{"v":0,"d":"0.0"},"HC","HC"]
[20,{"$f":"дети!A20","v":0},{"v":0,"d":"0.0"},{"v":0,"d":"0.0"},{"v":0,"d":"0.0"},{"v":0,"d":"0.0"},{"v":0,"d":"0.0"},{"v":0,"d":"0.0"},{"v":0,"d":"0.0"},{"v":0,"d":"0.0"},{"v":0,"d":"0.0"},{"v":0,"d":"0.0"},{"$f":"IF(K28=3,\"B\",IF(K28>=2,\"C\",\"HC\"))","v":"HC"},"HC"]
[21,{"$f":"дети!A21","v":0},{"v":0,"d":"0.0"},{"v":0,"d":"0.0"},{"v":0,"d":"0.0"},{"v":0,"d":"0.0"},{"v":0,"d":"0.0"},{"v":0,"d":"0.0"},{"v":0,"d":"0.0"},{"v":0,"d":"0.0"},{"v":0,"d":"0.0"},{"v":0,"d":"0.0"},"HC","HC"]
[22,{"$f":"дети!A22","v":0},{"v":0,"d":"0.0"},{"v":0,"d":"0.0"},{"v":0,"d":"0.0"},{"v":0,"d":"0.0"},{"v":0,"d":"0.0"},{"v":0,"d":"0.0"},{"v":0,"d":"0.0"},{"v":0,"d":"0.0"},{"v":0,"d":"0.0"},{"v":0,"d":"0.0"},"HC","HC"]
[23,{"$f":"дети!A23","v":0},{"v":0,"d":"0.0"},{"v":0,"d":"0.0"},{"v":0,"d":"0.0"},{"v":0,"d":"0.0"},{"v":0,"d":"0.0"},{"v":0,"d":"0.0"},{"v":0,"d":"0.0"},{"v":0,"d":"0.0"},{"v":0,"d":"0.0"},{"v":0,"d":"0.0"},"HC","HC"]
[24,{"$f":"дети!A24","v":0},{"v":0,"d":"0.0"},{"v":0,"d":"0.0"},{"v":0,"d":"0.0"},{"v":0,"d":"0.0"},{"v":0,"d":"0.0"},{"v":0,"d":"0.0"},{"v":0,"d":"0.0"},{"v":0,"d":"0.0"},{"v":0,"d":"0.0"},{"v":0,"d":"0.0"},"HC","HC"]
[25,{"$f":"дети!A25","v":0},{"v":0,"d":"0.0"},{"v":0,"d":"0.0"},{"v":0,"d":"0.0"},{"v":0,"d":"0.0"},{"v":0,"d":"0.0"},{"v":0,"d":"0.0"},{"v":0,"d":"0.0"},{"v":0,"d":"0.0"},{"v":0,"d":"0.0"},{"$f":"(D33+F33+H33+J33)/4","v":{"v":0,"d":"0.0"}},"HC",{"$f":"IF(L33=3,\"B\",IF(L33>=2,\"C\",\"HC\"))","v":"HC"}]
[26,{"$f":"дети!A26","v":0},{"v":0,"d":"0.0"},{"v":0,"d":"0.0"},{"v":0,"d":"0.0"},{"v":0,"d":"0.0"},{"v":0,"d":"0.0"},{"v":0,"d":"0.0"},{"v":0,"d":"0.0"},{"v":0,"d":"0.0"},{"v":0,"d":"0.0"},{"v":0,"d":"0.0"},"HC","HC"]
[27,{"$f":"дети!A27","v":0},{"v":0,"d":"0.0"},{"v":0,"d":"0.0"},{"v":0,"d":"0.0"},{"v":0,"d":"0.0"},{"v":0,"d":"0.0"},{"v":0,"d":"0.0"},{"v":0,"d":"0.0"},{"v":0,"d":"0.0"},{"v":0,"d":"0.0"},{"$f":"(D35+F35+H35+J35)/4","v":{"v":0,"d":"0.0"}},"HC",{"$f":"IF(L35=3,\"B\",IF(L35>=2,\"C\",\"HC\"))","v":"HC"}]
[28,{"$f":"дети!A28","v":0},{"v":2,"d":"2.0"},{"v":3,"d":"3.0"},{"v":2,"d":"2.0"},{"v":3,"d":"3.0"},{"v":2,"d":"2.0"},{"v":3,"d":"3.0"},{"v":2,"d":"2.0"},{"v":2,"d":"2.0"},{"v":2,"d":"2.0"},{"$f":"(D36+F36+H36+J36)/4","v":{"v":2.75,"d":"2.8"}},"C",{"$f":"IF(L36=3,\"B\",IF(L36>=2,\"C\",\"HC\"))","v":"C"}]
["Итоговый пок-ль по группе (ср. знач.)",null,{"$f":"SUM(C9:C36)/дети!G2","v":{"$error":"#DIV/0!"}},{"$f":"SUM(D9:D36)/дети!G2","v":{"$error":"#DIV/0!"}},{"$f":"SUM(E9:E36)/дети!G2","v":{"$error":"#DIV/0!"}},{"$f":"SUM(F9:F36)/дети!G2","v":{"$error":"#DIV/0!"}},{"$f":"SUM(G9:G36)/дети!G2","v":{"$error":"#DIV/0!"}},{"$f":"SUM(H9:H36)/дети!G2","v":{"$error":"#DIV/0!"}},{"$f":"SUM(I9:I36)/дети!G2","v":{"$error":"#DIV/0!"}},{"$f":"SUM(J9:J36)/дети!G2","v":{"$error":"#DIV/0!"}},{"$f":"SUM(K9:K36)/дети!G2","v":{"$error":"#DIV/0!"}},{"$f":"SUM(L9:L36)/дети!G2","v":{"$error":"#DIV/0!"}}]
[null,"\"3\" Сформирован (В)",{"$f":"COUNTIF(C9:C36,\"=3\")/дети!G2","v":{"$error":"#DIV/0!"}},{"$f":"COUNTIF(D9:D36,\"=3\")/дети!G2","v":{"$error":"#DIV/0!"}},{"$f":"COUNTIF(E9:E36,\"=3\")/дети!G2","v":{"$error":"#DIV/0!"}},{"$f":"COUNTIF(F9:F36,\"=3\")/дети!G2","v":{"$error":"#DIV/0!"}},{"$f":"COUNTIF(G9:G36,\"=3\")/дети!G2","v":{"$error":"#DIV/0!"}},{"$f":"COUNTIF(H9:H36,\"=3\")/дети!G2","v":{"$error":"#DIV/0!"}},{"$f":"COUNTIF(I9:I36,\"=3\")/дети!G2","v":{"$error":"#DIV/0!"}},{"$f":"COUNTIF(J9:J36,\"=3\")/дети!G2","v":{"$error":"#DIV/0!"}},{"$f":"COUNTIF(K9:K36,\"=3\")/дети!G2","v":{"$error":"#DIV/0!"}},{"$f":"COUNTIF(L9:L36,\"=3\")/дети!G2","v":{"$error":"#DIV/0!"}}]
[null,"\"2\" Находится в стадии формирования (С)",{"$f":"COUNTIF(C9:C36,\"=2\")/дети!G2","v":{"$error":"#DIV/0!"}},{"$f":"COUNTIF(D9:D36,\"=2\")/дети!G2","v":{"$error":"#DIV/0!"}},{"$f":"COUNTIF(E9:E36,\"=2\")/дети!G2","v":{"$error":"#DIV/0!"}},{"$f":"COUNTIF(F9:F36,\"=2\")/дети!G2","v":{"$error":"#DIV/0!"}},{"$f":"COUNTIF(G9:G36,\"=2\")/дети!G2","v":{"$error":"#DIV/0!"}},{"$f":"COUNTIF(H9:H36,\"=2\")/дети!G2","v":{"$error":"#DIV/0!"}},{"$f":"COUNTIF(I9:I36,\"=2\")/дети!G2","v":{"$error":"#DIV/0!"}},{"$f":"COUNTIF(J9:J36,\"=2\")/дети!G2","v":{"$error":"#DIV/0!"}},{"$f":"100%-(K40+K38)","v":{"$error":"#DIV/0!"}},{"$f":"100%-(L40+L38)","v":{"$error":"#DIV/0!"}}]
[null,"\"1\" Не сформирован (НС)",{"$f":"COUNTIF(C9:C36,\"=1\")/дети!G2","v":{"$error":"#DIV/0!"}},{"$f":"COUNTIF(D9:D36,\"=1\")/дети!G2","v":{"$error":"#DIV/0!"}},{"$f":"COUNTIF(E9:E36,\"=1\")/дети!G2","v":{"$error":"#DIV/0!"}},{"$f":"COUNTIF(F9:F36,\"=1\")/дети!G2","v":{"$error":"#DIV/0!"}},{"$f":"COUNTIF(G9:G36,\"=1\")/дети!G2","v":{"$error":"#DIV/0!"}},{"$f":"COUNTIF(H9:H36,\"=1\")/дети!G2","v":{"$error":"#DIV/0!"}},{"$f":"COUNTIF(I9:I36,\"=1\")/дети!G2","v":{"$error":"#DIV/0!"}},{"$f":"COUNTIF(J9:J36,\"=1\")/дети!G2","v":{"$error":"#DIV/0!"}},{"$f":"COUNTIF(K9:K36,\"<2\")/дети!G2","v":{"$error":"#DIV/0!"}},{"$f":"COUNTIF(L9:L36,\"<2\")/дети!G2","v":{"$error":"#DIV/0!"}}]
["Общий уровень по образовательной области: начало уч. г.___________________________________________       конец уч. г.___________________________________________"]

{"sheet":"дети","index":7,"n_rows":32,"n_cols":7,"rows_kept":32}
[]
[{"$nulls":4},"количество детей",null,0]
{"$rows_empty":27}
["Мониторинг образовательного процесса группы №___ (подготовительная)  на  20___-20___ уч год"]
["Воспитатель: ____________"]
["Воспитатель: ______________"]

{"sheet":"Аннотация","index":8,"n_rows":11,"n_cols":1,"rows_kept":11}
[]
["вкладка \"Дети\""]
["1.В столбец \"А\" - вписать детей (\"автоматом выпрыгнут\")"]
["2.количество детей ячейка - \"G2\" надо обязательно свои данные поставить"]
["3. Вписать 34,35,36 строки - \"автоматом\" выходят на остальных страницах"]
[]
[]
["4. Чтобы формулы были верны, надо в каждой таблице ненужные строки с детьми (начиная с нижних) удалить"]
["5. Данные в ячейках не удаляйте, чтобы не сбить формулы. Можно удалять/очищать данные на начало/конец года, напротив детей И ВСЕ!!!"]
["В цветных ячейках формулы - НЕ МЕНЯТЬ, НЕ УДАЛЯТЬ"]
["6. Вкладка \"МОНИТОРИНГ\" программируется сама. Данные вбивать не надо"]